{"text_format":"1","workbook":"xlsx","n_sheets":6,"sheets":["Protocol 1 (5nm)","Protocol 2 (native)","Protocol 3","Reference Comparison","Data","Version 2.2 Lite"],"not_rendered":{"charts":9,"images":9,"macros":1,"external_links":0,"defined_names":4,"comments":0,"pivot_tables":0},"unopened":[],"bounds":{"document_bytes":16777216,"sheet_cells":100000,"rows_first":2000,"rows_last":500,"rows_between":2000,"halvings":0,"cell_chars":16384,"cell_head_chars":4096},"cells_cut":0,"cells_raw":0,"read":"whole","date_system":"1900"}

{"sheet":"Protocol 1 (5nm)","index":0,"n_rows":58,"n_cols":93,"rows_kept":58,"cut":false,"hidden":false,"merged":[[30,34,30,36],[30,37,30,38],[30,39,30,46],[3,84,3,99],[22,34,22,64],[3,13,3,58],[28,51,28,63],[28,68,28,80],[4,13,4,58],[5,13,5,58],[22,10,22,15],[23,10,23,15],[24,10,24,15],[23,17,23,21],[23,22,23,23],[24,17,24,21],[29,71,29,72],[30,71,30,72],[22,65,22,81],[22,17,22,21],[24,22,24,23],[29,73,29,80],[30,73,30,80],[4,62,4,83],[3,0,3,12],[24,65,24,81],[25,10,25,15],[28,34,28,46],[29,34,29,36],[22,8,22,9],[23,8,23,9],[24,8,24,9],[25,8,25,9],[26,8,26,9],[27,8,27,9],[26,10,26,15],[27,10,27,15],[29,51,29,53],[24,34,24,64],[29,54,29,55],[25,65,25,81],[30,54,30,55],[25,34,25,64],[22,24,22,31],[23,24,23,31],[24,24,24,31],[32,3,32,7],[32,8,32,9],[32,10,32,15],[29,3,29,7],[28,8,28,9],[28,10,28,15],[30,8,30,9],[30,3,30,7],[30,10,30,15],[29,8,29,9],[28,3,28,7],[31,8,31,9],[31,10,31,15],[44,22,44,29],[44,30,44,35],[42,30,42,35],[42,36,42,43],[43,30,43,35],[43,36,43,43],[57,0,57,14],[34,3,34,7],[34,8,34,9],[34,10,34,15],[35,3,35,7],[35,8,35,9],[35,10,35,15],[46,2,46,7],[44,2,44,7],[45,8,45,15],[42,16,42,21],[42,22,42,29],[43,16,43,21],[43,22,43,29],[40,2,40,7],[39,2,39,7],[41,2,41,7],[36,3,36,7],[39,30,39,35],[40,22,40,29],[41,16,41,21],[39,58,39,63],[39,64,39,71],[30,51,30,53],[29,10,29,15],[39,36,39,43],[39,16,39,21],[39,22,39,29],[40,16,40,21],[41,36,41,43],[40,30,40,35],[41,22,41,29],[39,44,39,49],[41,44,41,49],[39,50,39,57],[40,44,40,49],[29,56,29,63],[30,56,30,63],[29,68,29,70],[30,68,30,70],[29,37,29,38],[29,39,29,46],[50,78,50,85],[49,72,49,77],[50,72,50,77],[46,58,46,63],[42,58,42,63],[42,64,42,71],[47,78,47,85],[43,72,43,77],[43,78,43,85],[44,72,44,77],[44,78,44,85],[45,64,45,71],[45,72,45,77],[45,78,45,85],[47,72,47,77],[43,58,43,63],[43,64,43,71],[44,58,44,63],[48,58,48,63],[48,64,48,71],[47,58,47,63],[47,64,47,71],[51,86,51,91],[51,92,51,99],[39,72,39,77],[39,78,39,85],[40,72,40,77],[40,78,40,85],[41,72,41,77],[41,78,41,85],[42,72,42,77],[42,78,42,85],[48,72,48,77],[48,78,48,85],[41,86,41,91],[41,92,41,99],[50,92,50,99],[46,86,46,91],[46,92,46,99],[45,86,45,91],[45,92,45,99],[47,86,47,91],[47,92,47,99],[50,86,50,91],[42,86,42,91],[42,92,42,99],[42,44,42,49],[43,92,43,99],[46,72,46,77],[46,78,46,85],[43,50,43,57],[44,64,44,71],[40,58,40,63],[40,64,40,71],[41,58,41,63],[41,64,41,71],[43,86,43,91],[46,50,46,57],[46,64,46,71],[45,50,45,57],[45,58,45,63],[44,50,44,57],[42,50,42,57],[40,50,40,57],[41,50,41,57],[42,8,42,15],[43,8,43,15],[40,8,40,15],[41,8,41,15],[47,50,47,57],[48,50,48,57],[47,44,47,49],[50,44,50,49],[40,36,40,43],[41,30,41,35],[49,36,49,43],[45,30,45,35],[45,36,45,43],[48,44,48,49],[49,44,49,49],[45,44,45,49],[46,36,46,43],[47,30,47,35],[47,36,47,43],[48,36,48,43],[46,44,46,49],[44,36,44,43],[43,44,43,49],[44,44,44,49],[49,50,49,57],[49,58,49,63],[49,64,49,71],[50,58,50,63],[50,64,50,71],[51,36,51,43],[50,22,50,29],[48,22,48,29],[51,44,51,49],[51,50,51,57],[48,30,48,35],[50,50,50,57],[50,30,50,35],[49,8,49,15],[33,3,33,7],[33,8,33,9],[22,3,22,7],[36,10,36,15],[44,16,44,21],[46,30,46,35],[47,22,47,29],[49,30,49,35],[22,22,22,23],[26,3,26,7],[27,3,27,7],[23,3,23,7],[24,3,24,7],[25,3,25,7],[33,10,33,15],[39,8,39,15],[31,3,31,7],[45,2,45,7],[44,8,44,15],[46,8,46,15],[42,2,42,7],[43,2,43,7],[36,8,36,9],[57,63,57,83],[57,84,57,101],[0,0,1,53],[49,86,49,91],[48,86,48,91],[49,92,49,99],[48,92,48,99],[40,92,40,99],[40,86,40,91],[39,92,39,99],[39,86,39,91],[44,92,44,99],[44,86,44,91],[57,15,57,26],[49,78,49,85],[4,84,4,99],[5,84,5,99],[3,62,3,83],[5,62,5,83],[45,16,45,21],[45,22,45,29],[46,16,46,21],[46,22,46,29],[49,2,49,7],[55,0,55,26],[50,36,50,43],[47,2,47,7],[50,16,50,21],[50,2,50,7],[47,16,47,21],[54,0,54,26],[53,0,53,26],[51,78,51,85],[48,8,48,15],[47,8,47,15],[51,72,51,77],[51,30,51,35],[51,8,51,15],[51,2,51,7],[51,16,51,21],[51,22,51,29],[48,2,48,7],[50,8,50,15],[48,16,48,21],[49,16,49,21],[49,22,49,29],[51,58,51,63],[51,64,51,71]]}
[{"$f":"IF(Data!$AE$2=\"DE\",\"Messprotokoll\",IF(Data!$AE$2=\"UK\",\"Measurement protocol\",IF(Data!$AE$2=\"FR\",\"Rapport de mesure\",\"Language Error\")))","v":"Measurement protocol"}]
[]
[]
[{"$f":"IF(Data!$AE$2 = \"DE\", \"Prüfling:\", IF(Data!$AE$2 = \"UK\",\"Test object:\",IF(Data!$AE$2=\"FR\",\"Objet testé:\",\"Language Error\")))","v":"Test object:"},null,null,null,null,null,null,null,null,null,null,null,null,{"$f":"IF(Data!$AE$2=\"DE\",\"Hersteller\",IF(Data!$AE$2=\"UK\",\"Manufacturer\",IF(Data!$AE$2=\"FR\",\"Fabricant\",\"Language Error\")))","v":"Manufacturer"},null,null,null,null,null,null,null,null,null,null,null,null,null,null,null,null,null,null,null,null,null,null,null,null,null,null,null,null,null,null,null,null,null,null,null,null,null,null,null,null,null,null,null,null,null,null,null,null,{"$f":"IF(Data!$AE$2=\"DE\",\"Messdatei:\",IF(Data!$AE$2=\"UK\",\"Measurement file:\",IF(Data!$AE$2=\"FR\",\"Fichier de mesure:\",\"Language Error\")))","v":"Measurement file:"},null,null,null,null,null,null,null,null,null,null,null,null,null,null,null,null,null,null,null,null,null,{"$f":"Data!Q18","v":"Measured"}]
[null,null,null,null,null,null,null,null,null,null,null,null,null,{"$f":"IF(Data!$AE$2=\"DE\",\"Typ\",IF(Data!$AE$2=\"UK\",\"Type\",IF(Data!$AE$2=\"FR\",\"Type\",\"Language Error\")))","v":"Type"},null,null,null,null,null,null,null,null,null,null,null,null,null,null,null,null,null,null,null,null,null,null,null,null,null,null,null,null,null,null,null,null,null,null,null,null,null,null,null,null,null,null,null,null,null,null,null,null,{"$f":"IF(Data!$AE$2=\"DE\",\"Datum der Messung:\",IF(Data!$AE$2=\"UK\",\"Date of measurement:\",IF(Data!$AE$2=\"FR\",\"Date de mesure:\",\"Language Error\")))","v":"Date of measurement:"},null,null,null,null,null,null,null,null,null,null,null,null,null,null,null,null,null,null,null,null,null,{"$f":"Data!Q23","v":"29.09.2021"}]
[null,null,null,null,null,null,null,null,null,null,null,null,null,{"$f":"IF(Data!$AE$2=\"DE\",\"Modell\",IF(Data!$AE$2=\"UK\",\"Model\",IF(Data!$AE$2=\"FR\",\"Article\",\"Language Error\")))","v":"Model"},null,null,null,null,null,null,null,null,null,null,null,null,null,null,null,null,null,null,null,null,null,null,null,null,null,null,null,null,null,null,null,null,null,null,null,null,null,null,null,null,null,null,null,null,null,null,null,null,{"$f":"IF(Data!$AE$2=\"DE\",\"Uhrzeit der Messung:\",IF(Data!$AE$2=\"UK\",\"Time of measurement:\",IF(Data!$AE$2=\"FR\",\"Heure de mesure:\",\"Language Error\")))","v":"Time of measurement:"},null,null,null,null,null,null,null,null,null,null,null,null,null,null,null,null,null,null,null,null,null,{"$f":"Data!Q21","v":"10:06:00"}]
[]
[]
[]
[]
[]
[]
[]
[]
[]
[]
[]
[]
[]
[]
[]
[]
[null,null,null,"R1",null,null,null,null,"=",null,{"$f":"Data!K2","v":96.04},null,null,null,null,null,null,"Ra",null,null,null,null,"=",null,{"$f":"Data!K1","v":96.81},null,null,null,null,null,null,null,null,null,{"$f":"IF(Data!$AE$2=\"DE\",\"Beleuchtungsstärke\",IF(Data!$AE$2=\"UK\",\"Illuminance\",IF(Data!$AE$2=\"FR\",\"Illuminance\",\"Language Error\")))","v":"Illuminance"},null,null,null,null,null,null,null,null,null,null,null,null,null,null,null,null,null,null,null,null,null,null,null,null,null,null,null,null,null,null,{"$f":"Data!K33","v":1214.58}]
[null,null,null,"R2",null,null,null,null,"=",null,{"$f":"Data!K3","v":97.94},null,null,null,null,null,null,"Re",null,null,null,null,"=",null,{"$f":"Data!Q27","v":95.79}]
[null,null,null,"R3",null,null,null,null,"=",null,{"$f":"Data!K4","v":98.67},null,null,null,null,null,null,"GAI",null,null,null,null,"=",null,{"$f":"Data!Q28","v":83.56},null,null,null,null,null,null,null,null,null,{"$f":"IF(Data!$AE$2 = \"DE\", \"Ähnlichste Farbtemperatur (CCT)\", IF(Data!$AE$2 = \"UK\",\"Correlated Color Temperature (CCT)\",IF(Data!$AE$2=\"FR\",\"Temp. de couleur proximale (CCT)\",\"Language Error\")))","v":"Correlated Color Temperature (CCT)"},null,null,null,null,null,null,null,null,null,null,null,null,null,null,null,null,null,null,null,null,null,null,null,null,null,null,null,null,null,null,{"$f":"Data!K30","v":5040}]
[null,null,null,"R4",null,null,null,null,"=",null,{"$f":"Data!K5","v":95.47},null,null,null,null,null,null,null,null,null,null,null,null,null,null,null,null,null,null,null,null,null,null,null,"Duv",null,null,null,null,null,null,null,null,null,null,null,null,null,null,null,null,null,null,null,null,null,null,null,null,null,null,null,null,null,null,{"$f":"Data!K31","v":7.1999999999999998E-3}]
[null,null,null,"R5",null,null,null,null,"=",null,{"$f":"Data!K6","v":96.13}]
[null,null,null,"R6",null,null,null,null,"=",null,{"$f":"Data!K7","v":97.65}]
[null,null,null,"R7",null,null,null,null,"=",null,{"$f":"Data!K8","v":97.96},null,null,null,null,null,null,null,null,null,null,null,null,null,null,null,null,null,null,null,null,null,null,null,{"$f":"IF(AI30=\"x\",\"CIE1931\",IF(AI30=\"u'\",\"CIE1976\",IF(AI30=\"u\",\"CIE1960\",\"\")))","v":"CIE1931"},null,null,null,null,null,null,null,null,null,null,null,null,null,null,null,null,{"$f":"IF(AZ30=\"x\",\"CIE1931\",IF(AZ30=\"u'\",\"CIE1976\",IF(AZ30=\"u\",\"CIE1960\",\"\")))","v":"CIE1960"},null,null,null,null,null,null,null,null,null,null,null,null,null,null,null,null,{"$f":"IF(BQ30=\"x\",\"CIE1931\",IF(BQ30=\"u'\",\"CIE1976\",IF(BQ30=\"u\",\"CIE1960\",\"\")))","v":"CIE1976"}]
[null,null,null,"R8",null,null,null,null,"=",null,{"$f":"Data!K9","v":94.59},null,null,null,null,null,null,null,null,null,null,null,null,null,null,null,null,null,null,null,null,null,null,null,{"$f":"Data!J23","v":"x"},null,null,"=",null,{"$f":"Data!K23","v":0.3453},null,null,null,null,null,null,null,null,null,null,null,{"$f":"Data!J27","v":"u"},null,null,"=",null,{"$f":"Data!K27","v":0.20599999999999999},null,null,null,null,null,null,null,null,null,null,null,{"$f":"Data!J25","v":"u'"},null,null,"=",null,{"$f":"Data!K25","v":0.20599999999999999}]
[null,null,null,"R9",null,null,null,null,"=",null,{"$f":"Data!K10","v":85.98},null,null,null,null,null,null,null,null,null,null,null,null,null,null,null,null,null,null,null,null,null,null,null,{"$f":"Data!J24","v":"y"},null,null,"=",null,{"$f":"Data!K24","v":0.36630000000000001},null,null,null,null,null,null,null,null,null,null,null,{"$f":"Data!J28","v":"v"},null,null,"=",null,{"$f":"Data!K28","v":0.32779999999999998},null,null,null,null,null,null,null,null,null,null,null,{"$f":"Data!J26","v":"v'"},null,null,"=",null,{"$f":"Data!K26","v":0.49170000000000003}]
[null,null,null,"R10",null,null,null,null,"=",null,{"$f":"Data!K11","v":96.26}]
[null,null,null,"R11",null,null,null,null,"=",null,{"$f":"Data!K12","v":94.96}]
[null,null,null,"R12",null,null,null,null,"=",null,{"$f":"Data!K13","v":95.33}]
[null,null,null,"R13",null,null,null,null,"=",null,{"$f":"Data!K14","v":96.38}]
[null,null,null,"R14",null,null,null,null,"=",null,{"$f":"Data!K15","v":98.98}]
[null,null,null,"R15",null,null,null,null,"=",null,{"$f":"Data!K16","v":94.47}]
[]
[]
[null,null,"[nm]",null,null,null,null,null,"mW/m²/nm",null,null,null,null,null,null,null,"[nm]",null,null,null,null,null,"mW/m²/nm",null,null,null,null,null,null,null,"[nm]",null,null,null,null,null,"mW/m²/nm",null,null,null,null,null,null,null,"[nm]",null,null,null,null,null,"mW/m²/nm",null,null,null,null,null,null,null,"[nm]",null,null,null,null,null,"mW/m²/nm",null,null,null,null,null,null,null,"[nm]",null,null,null,null,null,"mW/m²/nm",null,null,null,null,null,null,null,"[nm]",null,null,null,null,null,"mW/m²/nm"]
[null,null,{"$f":"Data!G1","v":380},null,null,null,null,null,{"$f":"Data!H1","v":1.7470250000000001},null,null,null,null,null,null,null,{"$f":"Data!G13","v":440},null,null,null,null,null,{"$f":"Data!H13","v":11.434519999999999},null,null,null,null,null,null,null,{"$f":"Data!G25","v":500},null,null,null,null,null,{"$f":"Data!H25","v":16.311502000000001},null,null,null,null,null,null,null,{"$f":"Data!G37","v":560},null,null,null,null,null,{"$f":"Data!H37","v":17.214663000000002},null,null,null,null,null,null,null,{"$f":"Data!G49","v":620},null,null,null,null,null,{"$f":"Data!H49","v":16.033514},null,null,null,null,null,null,null,{"$f":"Data!G61","v":680},null,null,null,null,null,{"$f":"Data!H61","v":15.248099},null,null,null,null,null,null,null,{"$f":"Data!G73","v":740},null,null,null,null,null,{"$f":"Data!H73","v":17.517562999999999}]
[null,null,{"$f":"Data!G2","v":385},null,null,null,null,null,{"$f":"Data!H2","v":1.9551480000000001},null,null,null,null,null,null,null,{"$f":"Data!G14","v":445},null,null,null,null,null,{"$f":"Data!H14","v":12.582395999999999},null,null,null,null,null,null,null,{"$f":"Data!G26","v":505},null,null,null,null,null,{"$f":"Data!H26","v":16.393141},null,null,null,null,null,null,null,{"$f":"Data!G38","v":565},null,null,null,null,null,{"$f":"Data!H38","v":16.857655000000001},null,null,null,null,null,null,null,{"$f":"Data!G50","v":625},null,null,null,null,null,{"$f":"Data!H50","v":15.820515},null,null,null,null,null,null,null,{"$f":"Data!G62","v":685},null,null,null,null,null,{"$f":"Data!H62","v":14.304793},null,null,null,null,null,null,null,{"$f":"Data!G74","v":745},null,null,null,null,null,{"$f":"Data!H74","v":18.14922}]
[null,null,{"$f":"Data!G3","v":390},null,null,null,null,null,{"$f":"Data!H3","v":2.3422209999999999},null,null,null,null,null,null,null,{"$f":"Data!G15","v":450},null,null,null,null,null,{"$f":"Data!H15","v":13.676095},null,null,null,null,null,null,null,{"$f":"Data!G27","v":510},null,null,null,null,null,{"$f":"Data!H27","v":16.575796},null,null,null,null,null,null,null,{"$f":"Data!G39","v":570},null,null,null,null,null,{"$f":"Data!H39","v":16.620396},null,null,null,null,null,null,null,{"$f":"Data!G51","v":630},null,null,null,null,null,{"$f":"Data!H51","v":15.616255000000001},null,null,null,null,null,null,null,{"$f":"Data!G63","v":690},null,null,null,null,null,{"$f":"Data!H63","v":13.662929999999999},null,null,null,null,null,null,null,{"$f":"Data!G75","v":750},null,null,null,null,null,{"$f":"Data!H75","v":18.020264000000001}]
[null,null,{"$f":"Data!G4","v":395},null,null,null,null,null,{"$f":"Data!H4","v":3.0443509999999998},null,null,null,null,null,null,null,{"$f":"Data!G16","v":455},null,null,null,null,null,{"$f":"Data!H16","v":14.475695},null,null,null,null,null,null,null,{"$f":"Data!G28","v":515},null,null,null,null,null,{"$f":"Data!H28","v":16.400569999999998},null,null,null,null,null,null,null,{"$f":"Data!G40","v":575},null,null,null,null,null,{"$f":"Data!H40","v":16.517523000000001},null,null,null,null,null,null,null,{"$f":"Data!G52","v":635},null,null,null,null,null,{"$f":"Data!H52","v":15.801816000000001},null,null,null,null,null,null,null,{"$f":"Data!G64","v":695},null,null,null,null,null,{"$f":"Data!H64","v":14.074071},null,null,null,null,null,null,null,{"$f":"Data!G76","v":755},null,null,null,null,null,{"$f":"Data!H76","v":15.876512999999999}]
[null,null,{"$f":"Data!G5","v":400},null,null,null,null,null,{"$f":"Data!H5","v":4.4780259999999998},null,null,null,null,null,null,null,{"$f":"Data!G17","v":460},null,null,null,null,null,{"$f":"Data!H17","v":14.90868},null,null,null,null,null,null,null,{"$f":"Data!G29","v":520},null,null,null,null,null,{"$f":"Data!H29","v":16.492079},null,null,null,null,null,null,null,{"$f":"Data!G41","v":580},null,null,null,null,null,{"$f":"Data!H41","v":16.530363000000001},null,null,null,null,null,null,null,{"$f":"Data!G53","v":640},null,null,null,null,null,{"$f":"Data!H53","v":15.819179999999999},null,null,null,null,null,null,null,{"$f":"Data!G65","v":700},null,null,null,null,null,{"$f":"Data!H65","v":14.629459000000001},null,null,null,null,null,null,null,{"$f":"Data!G77","v":760},null,null,null,null,null,{"$f":"Data!H77","v":12.366732000000001}]
[null,null,{"$f":"Data!G6","v":405},null,null,null,null,null,{"$f":"Data!H6","v":5.9537769999999997},null,null,null,null,null,null,null,{"$f":"Data!G18","v":465},null,null,null,null,null,{"$f":"Data!H18","v":15.160750999999999},null,null,null,null,null,null,null,{"$f":"Data!G30","v":525},null,null,null,null,null,{"$f":"Data!H30","v":16.956896},null,null,null,null,null,null,null,{"$f":"Data!G42","v":585},null,null,null,null,null,{"$f":"Data!H42","v":16.294405000000001},null,null,null,null,null,null,null,{"$f":"Data!G54","v":645},null,null,null,null,null,{"$f":"Data!H54","v":15.523285},null,null,null,null,null,null,null,{"$f":"Data!G66","v":705},null,null,null,null,null,{"$f":"Data!H66","v":15.202375},null,null,null,null,null,null,null,{"$f":"Data!G78","v":765},null,null,null,null,null,{"$f":"Data!H78","v":12.548769999999999}]
[null,null,{"$f":"Data!G7","v":410},null,null,null,null,null,{"$f":"Data!H7","v":6.9295419999999996},null,null,null,null,null,null,null,{"$f":"Data!G19","v":470},null,null,null,null,null,{"$f":"Data!H19","v":15.360201},null,null,null,null,null,null,null,{"$f":"Data!G31","v":530},null,null,null,null,null,{"$f":"Data!H31","v":17.308287},null,null,null,null,null,null,null,{"$f":"Data!G43","v":590},null,null,null,null,null,{"$f":"Data!H43","v":15.751006},null,null,null,null,null,null,null,{"$f":"Data!G55","v":650},null,null,null,null,null,{"$f":"Data!H55","v":15.154457000000001},null,null,null,null,null,null,null,{"$f":"Data!G67","v":710},null,null,null,null,null,{"$f":"Data!H67","v":15.358993999999999},null,null,null,null,null,null,null,{"$f":"Data!G79","v":770},null,null,null,null,null,{"$f":"Data!H79","v":15.813597}]
[null,null,{"$f":"Data!G8","v":415},null,null,null,null,null,{"$f":"Data!H8","v":8.1653699999999994},null,null,null,null,null,null,null,{"$f":"Data!G20","v":475},null,null,null,null,null,{"$f":"Data!H20","v":15.666918000000001},null,null,null,null,null,null,null,{"$f":"Data!G32","v":535},null,null,null,null,null,{"$f":"Data!H32","v":17.530825},null,null,null,null,null,null,null,{"$f":"Data!G44","v":595},null,null,null,null,null,{"$f":"Data!H44","v":15.803174},null,null,null,null,null,null,null,{"$f":"Data!G56","v":655},null,null,null,null,null,{"$f":"Data!H56","v":15.060684999999999},null,null,null,null,null,null,null,{"$f":"Data!G68","v":715},null,null,null,null,null,{"$f":"Data!H68","v":14.246861000000001},null,null,null,null,null,null,null,{"$f":"Data!G80","v":775},null,null,null,null,null,{"$f":"Data!H80","v":17.428082}]
[null,null,{"$f":"Data!G9","v":420},null,null,null,null,null,{"$f":"Data!H9","v":8.8666110000000007},null,null,null,null,null,null,null,{"$f":"Data!G21","v":480},null,null,null,null,null,{"$f":"Data!H21","v":15.932422000000001},null,null,null,null,null,null,null,{"$f":"Data!G33","v":540},null,null,null,null,null,{"$f":"Data!H33","v":17.427284},null,null,null,null,null,null,null,{"$f":"Data!G45","v":600},null,null,null,null,null,{"$f":"Data!H45","v":16.115704000000001},null,null,null,null,null,null,null,{"$f":"Data!G57","v":660},null,null,null,null,null,{"$f":"Data!H57","v":15.393768},null,null,null,null,null,null,null,{"$f":"Data!G69","v":720},null,null,null,null,null,{"$f":"Data!H69","v":13.123232},null,null,null,null,null,null,null,{"$f":"Data!G81","v":780},null,null,null,null,null,{"$f":"Data!H81","v":17.473745000000001}]
[null,null,{"$f":"Data!G10","v":425},null,null,null,null,null,{"$f":"Data!H10","v":9.1403680000000005},null,null,null,null,null,null,null,{"$f":"Data!G22","v":485},null,null,null,null,null,{"$f":"Data!H22","v":15.754631},null,null,null,null,null,null,null,{"$f":"Data!G34","v":545},null,null,null,null,null,{"$f":"Data!H34","v":17.464561},null,null,null,null,null,null,null,{"$f":"Data!G46","v":605},null,null,null,null,null,{"$f":"Data!H46","v":16.306222999999999},null,null,null,null,null,null,null,{"$f":"Data!G58","v":665},null,null,null,null,null,{"$f":"Data!H58","v":15.698565},null,null,null,null,null,null,null,{"$f":"Data!G70","v":725},null,null,null,null,null,{"$f":"Data!H70","v":13.262581000000001}]
[null,null,{"$f":"Data!G11","v":430},null,null,null,null,null,{"$f":"Data!H11","v":9.2625890000000002},null,null,null,null,null,null,null,{"$f":"Data!G23","v":490},null,null,null,null,null,{"$f":"Data!H23","v":15.870525000000001},null,null,null,null,null,null,null,{"$f":"Data!G35","v":550},null,null,null,null,null,{"$f":"Data!H35","v":17.491382999999999},null,null,null,null,null,null,null,{"$f":"Data!G47","v":610},null,null,null,null,null,{"$f":"Data!H47","v":16.259893000000002},null,null,null,null,null,null,null,{"$f":"Data!G59","v":670},null,null,null,null,null,{"$f":"Data!H59","v":15.748817000000001},null,null,null,null,null,null,null,{"$f":"Data!G71","v":730},null,null,null,null,null,{"$f":"Data!H71","v":14.46374}]
[null,null,{"$f":"Data!G12","v":435},null,null,null,null,null,{"$f":"Data!H12","v":10.222623},null,null,null,null,null,null,null,{"$f":"Data!G24","v":495},null,null,null,null,null,{"$f":"Data!H24","v":16.288945999999999},null,null,null,null,null,null,null,{"$f":"Data!G36","v":555},null,null,null,null,null,{"$f":"Data!H36","v":17.440124999999998},null,null,null,null,null,null,null,{"$f":"Data!G48","v":615},null,null,null,null,null,{"$f":"Data!H48","v":16.116161000000002},null,null,null,null,null,null,null,{"$f":"Data!G60","v":675},null,null,null,null,null,{"$f":"Data!H60","v":15.637076},null,null,null,null,null,null,null,{"$f":"Data!G72","v":735},null,null,null,null,null,{"$f":"Data!H72","v":16.200191}]
[]
[{"$f":"IF(Data!$AE$2=\"DE\",\"Firma\",IF(Data!$AE$2=\"UK\",\"Company\",IF(Data!$AE$2=\"FR\",\"Société\",\"Language Error\")))","v":"Company"}]
[{"$f":"IF(Data!$AE$2=\"DE\",\"Adresse\",IF(Data!$AE$2=\"UK\",\"Address\",IF(Data!$AE$2=\"FR\",\"Adresse\",\"Language Error\")))","v":"Address"}]
[{"$f":"IF(Data!$AE$2=\"DE\",\"PLZ  Ort\",IF(Data!$AE$2=\"UK\",\"ZIP  City\",IF(Data!$AE$2=\"FR\",\"Code postal Ville\",\"Language Error\")))","v":"ZIP  City"}]
[]
[{"$f":"IF(Data!$AE$2=\"DE\",\"Prüfort,\",IF(Data!$AE$2=\"UK\",\"Test location,\",IF(Data!$AE$2=\"FR\",\"Lieu de rapport, \",\"Language Error\")))","v":"Test location,"},null,null,null,null,null,null,null,null,null,null,null,null,null,null,{"$f":"IF(Data!$AE$2=\"DE\",\"Datum\",IF(Data!$AE$2=\"UK\",\"Date\",IF(Data!$AE$2=\"FR\",\"Date\",\"Language Error\")))","v":"Date"},null,null,null,null,null,null,null,null,null,null,null,null,null,null,null,null,null,null,null,null,null,null,null,null,null,null,null,null,null,null,null,null,null,null,null,null,null,null,null,null,null,null,null,null,null,null,null,{"$f":"IF(Data!$AE$2=\"DE\",\"Vorname, Nachname Prüfer\",IF(Data!$AE$2=\"UK\",\"First, last name of inspector\",IF(Data!$AE$2=\"FR\",\"Prénom Nom du testeur\",\"Language Error\")))","v":"First, last name of inspector"},null,null,null,null,null,null,null,null,null,null,null,null,null,null,null,null,null,null,null,null,{"$f":"IF(Data!$AE$2=\"DE\",\"Telefonnummer\",IF(Data!$AE$2=\"UK\",\"Phone number\",IF(Data!$AE$2=\"FR\",\"N° téléphone\",\"Language Error\")))","v":"Phone number"}]

{"sheet":"Protocol 2 (native)","index":1,"n_rows":68,"n_cols":91,"rows_kept":68,"cut":false,"hidden":false,"merged":[[5,84,5,99],[51,85,51,89],[51,90,51,98],[52,85,52,89],[52,90,52,98],[46,85,46,89],[46,90,46,98],[47,85,47,89],[47,90,47,98],[48,85,48,89],[48,90,48,98],[49,85,49,89],[49,90,49,98],[50,85,50,89],[50,90,50,98],[41,85,41,89],[41,90,41,98],[42,85,42,89],[42,90,42,98],[36,85,36,89],[36,90,36,98],[37,85,37,89],[37,90,37,98],[38,85,38,89],[31,85,31,89],[31,90,31,98],[32,85,32,89],[32,90,32,98],[33,85,33,89],[33,90,33,98],[34,85,34,89],[34,90,34,98],[35,85,35,89],[35,90,35,98],[26,85,26,89],[26,90,26,98],[27,85,27,89],[27,90,27,98],[28,85,28,89],[28,90,28,98],[29,85,29,89],[29,90,29,98],[30,85,30,89],[30,90,30,98],[21,85,21,89],[21,90,21,98],[22,85,22,89],[22,90,22,98],[23,85,23,89],[23,90,23,98],[24,85,24,89],[24,90,24,98],[25,85,25,89],[25,90,25,98],[21,71,21,75],[21,76,21,84],[22,71,22,75],[22,76,22,84],[23,71,23,75],[23,76,23,84],[24,71,24,75],[24,76,24,84],[25,71,25,75],[25,76,25,84],[40,57,40,61],[40,62,40,70],[41,57,41,61],[41,62,41,70],[42,57,42,61],[42,62,42,70],[43,57,43,61],[43,62,43,70],[44,57,44,61],[44,62,44,70],[51,43,51,47],[51,48,51,56],[52,43,52,47],[52,48,52,56],[21,57,21,61],[21,62,21,70],[22,57,22,61],[22,62,22,70],[23,57,23,61],[23,62,23,70],[24,57,24,61],[24,62,24,70],[25,57,25,61],[25,62,25,70],[26,57,26,61],[26,62,26,70],[27,57,27,61],[27,62,27,70],[28,57,28,61],[28,62,28,70],[29,57,29,61],[29,62,29,70],[30,57,30,61],[30,62,30,70],[46,43,46,47],[46,48,46,56],[47,43,47,47],[47,48,47,56],[48,43,48,47],[48,48,48,56],[49,43,49,47],[49,48,49,56],[50,43,50,47],[50,48,50,56],[41,43,41,47],[41,48,41,56],[42,43,42,47],[42,48,42,56],[43,43,43,47],[43,48,43,56],[44,43,44,47],[44,48,44,56],[45,43,45,47],[45,48,45,56],[36,43,36,47],[36,48,36,56],[37,43,37,47],[37,48,37,56],[38,43,38,47],[38,48,38,56],[39,43,39,47],[39,48,39,56],[40,43,40,47],[40,48,40,56],[31,43,31,47],[32,43,32,47],[32,48,32,56],[33,43,33,47],[33,48,33,56],[34,43,34,47],[34,48,34,56],[35,43,35,47],[35,48,35,56],[31,48,31,56],[50,34,50,42],[51,34,51,42],[52,29,52,33],[52,34,52,42],[21,43,21,47],[21,48,21,56],[22,43,22,47],[22,48,22,56],[23,43,23,47],[23,48,23,56],[24,43,24,47],[24,48,24,56],[25,43,25,47],[25,48,25,56],[26,43,26,47],[26,48,26,56],[27,43,27,47],[27,48,27,56],[28,43,28,47],[28,48,28,56],[29,43,29,47],[29,48,29,56],[30,43,30,47],[30,48,30,56],[44,34,44,42],[45,29,45,33],[45,34,45,42],[46,34,46,42],[47,29,47,33],[47,34,47,42],[48,29,48,33],[48,34,48,42],[49,29,49,33],[49,34,49,42],[38,34,38,42],[39,29,39,33],[39,34,39,42],[40,29,40,33],[40,34,40,42],[41,34,41,42],[42,29,42,33],[42,34,42,42],[43,29,43,33],[43,34,43,42],[32,34,32,42],[33,29,33,33],[33,34,33,42],[34,29,34,33],[34,34,34,42],[35,29,35,33],[35,34,35,42],[36,34,36,42],[37,29,37,33],[37,34,37,42],[26,34,26,42],[27,29,27,33],[27,34,27,42],[28,29,28,33],[28,34,28,42],[29,29,29,33],[29,34,29,42],[30,29,30,33],[30,34,30,42],[26,29,26,33],[21,34,21,42],[22,29,22,33],[22,34,22,42],[23,29,23,33],[23,34,23,42],[24,29,24,33],[24,34,24,42],[25,29,25,33],[25,34,25,42],[21,29,21,33],[31,29,31,33],[36,29,36,33],[41,29,41,33],[46,29,46,33],[51,29,51,33],[44,15,44,19],[44,20,44,28],[45,15,45,19],[45,20,45,28],[46,15,46,19],[46,20,46,28],[47,15,47,19],[47,20,47,28],[48,15,48,19],[38,29,38,33],[44,29,44,33],[50,29,50,33],[43,15,43,19],[43,20,43,28],[49,15,49,19],[49,20,49,28],[50,15,50,19],[50,20,50,28],[51,15,51,19],[51,20,51,28],[52,15,52,19],[52,20,52,28],[21,15,21,19],[21,20,21,28],[22,15,22,19],[22,20,22,28],[23,15,23,19],[23,20,23,28],[24,15,24,19],[24,20,24,28],[25,15,25,19],[25,20,25,28],[26,15,26,19],[26,20,26,28],[42,15,42,19],[42,20,42,28],[30,15,30,19],[30,20,30,28],[31,15,31,19],[31,20,31,28],[32,15,32,19],[32,20,32,28],[33,15,33,19],[47,1,47,5],[48,1,48,5],[49,1,49,5],[50,1,50,5],[51,1,51,5],[52,1,52,5],[21,6,21,14],[22,6,22,14],[23,6,23,14],[24,6,24,14],[25,6,25,14],[26,6,26,14],[27,6,27,14],[28,6,28,14],[29,6,29,14],[30,6,30,14],[31,6,31,14],[32,6,32,14],[33,6,33,14],[34,6,34,14],[35,6,35,14],[36,6,36,14],[37,6,37,14],[38,6,38,14],[22,1,22,5],[21,1,21,5],[23,1,23,5],[24,1,24,5],[25,1,25,5],[26,1,26,5],[27,1,27,5],[28,1,28,5],[29,1,29,5],[47,6,47,14],[48,6,48,14],[49,6,49,14],[50,6,50,14],[51,6,51,14],[52,6,52,14],[27,15,27,19],[27,20,27,28],[28,15,28,19],[28,20,28,28],[29,15,29,19],[29,20,29,28],[39,6,39,14],[40,6,40,14],[41,6,41,14],[42,6,42,14],[43,6,43,14],[48,20,48,28],[39,15,39,19],[39,20,39,28],[40,15,40,19],[40,20,40,28],[41,15,41,19],[41,20,41,28],[39,1,39,5],[40,1,40,5],[41,1,41,5],[42,1,42,5],[44,6,44,14],[45,6,45,14],[46,6,46,14],[30,1,30,5],[31,1,31,5],[32,1,32,5],[33,1,33,5],[34,1,34,5],[35,1,35,5],[36,1,36,5],[37,1,37,5],[38,1,38,5],[43,1,43,5],[44,1,44,5],[45,1,45,5],[46,1,46,5],[53,135,53,140],[32,155,32,160],[42,161,42,164],[42,165,42,170],[33,115,33,120],[22,115,22,120],[22,155,22,160],[29,121,29,124],[25,121,25,124],[26,121,26,124],[27,115,27,120],[28,115,28,120],[29,115,29,120],[37,121,37,124],[38,121,38,124],[39,121,39,124],[24,115,24,120],[25,115,25,120],[26,115,26,120],[34,121,34,124],[33,155,33,160],[34,155,34,160],[23,145,23,150],[24,145,24,150],[22,161,22,164],[22,165,22,170],[22,135,22,140],[22,145,22,150],[22,151,22,154],[36,115,36,120],[42,115,42,120],[48,115,48,120],[42,125,42,130],[33,125,33,130],[25,125,25,130],[30,115,30,120],[31,115,31,120],[35,115,35,120],[34,115,34,120],[36,155,36,160],[37,155,37,160],[38,155,38,160],[47,115,47,120],[46,115,46,120],[45,115,45,120],[44,115,44,120],[43,115,43,120],[48,135,48,140],[38,115,38,120],[48,155,48,160],[49,155,49,160],[50,155,50,160],[47,155,47,160],[42,151,42,154],[39,151,39,154],[44,125,44,130],[45,125,45,130],[40,135,40,140],[41,135,41,140],[44,135,44,140],[45,135,45,140],[46,141,46,144],[43,135,43,140],[41,131,41,134],[47,125,47,130],[48,121,48,124],[48,125,48,130],[41,125,41,130],[43,151,43,154],[44,151,44,154],[45,151,45,154],[46,151,46,154],[37,151,37,154],[40,151,40,154],[41,151,41,154],[45,155,45,160],[46,155,46,160],[40,155,40,160],[41,155,41,160],[38,151,38,154],[50,135,50,140],[47,135,47,140],[38,141,38,144],[39,141,39,144],[40,141,40,144],[47,151,47,154],[44,145,44,150],[45,145,45,150],[46,145,46,150],[47,145,47,150],[48,145,48,150],[49,125,49,130],[49,135,49,140],[46,121,46,124],[46,125,46,130],[46,135,46,140],[48,151,48,154],[49,151,49,154],[50,151,50,154],[43,141,43,144],[53,141,53,144],[50,141,50,144],[51,141,51,144],[52,141,52,144],[50,145,50,150],[51,145,51,150],[52,145,52,150],[49,141,49,144],[51,151,51,154],[52,151,52,154],[53,151,53,154],[53,145,53,150],[49,145,49,150],[29,151,29,154],[29,155,29,160],[40,125,40,130],[30,111,30,114],[40,121,40,124],[39,125,39,130],[29,111,29,114],[38,125,38,130],[37,125,37,130],[36,125,36,130],[35,125,35,130],[34,125,34,130],[32,125,32,130],[31,125,31,130],[30,125,30,130],[29,125,29,130],[35,131,35,134],[36,131,36,134],[37,131,37,134],[32,131,32,134],[33,131,33,134],[34,131,34,134],[35,141,35,144],[36,141,36,144],[52,125,52,130],[53,125,53,130],[41,121,41,124],[42,121,42,124],[47,121,47,124],[28,125,28,130],[27,125,27,130],[26,125,26,130],[24,111,24,114],[25,111,25,114],[26,111,26,114],[27,111,27,114],[28,111,28,114],[27,121,27,124],[28,121,28,124],[24,125,24,130],[53,115,53,120],[52,115,52,120],[51,115,51,120],[50,115,50,120],[49,115,49,120],[47,111,47,114],[48,111,48,114],[52,111,52,114],[53,111,53,114],[23,121,23,124],[49,111,49,114],[50,111,50,114],[51,111,51,114],[24,121,24,124],[35,121,35,124],[36,121,36,124],[23,115,23,120],[33,121,33,124],[30,121,30,124],[31,121,31,124],[32,121,32,124],[23,111,23,114],[31,111,31,114],[32,111,32,114],[32,115,32,120],[45,121,45,124],[37,115,37,120],[49,121,49,124],[50,121,50,124],[41,115,41,120],[40,115,40,120],[39,115,39,120],[23,131,23,134],[24,131,24,134],[25,131,25,134],[51,121,51,124],[52,121,52,124],[53,121,53,124],[29,131,29,134],[30,131,30,134],[31,131,31,134],[48,131,48,134],[49,131,49,134],[50,131,50,134],[45,131,45,134],[46,131,46,134],[47,131,47,134],[43,131,43,134],[44,131,44,134],[42,131,42,134],[38,131,38,134],[39,131,39,134],[40,131,40,134],[23,125,23,130],[50,125,50,130],[51,125,51,130],[33,20,33,28],[34,15,34,19],[34,20,34,28],[35,15,35,19],[35,20,35,28],[36,15,36,19],[36,20,36,28],[37,15,37,19],[37,20,37,28],[38,15,38,19],[38,20,38,28],[31,34,31,42],[32,29,32,33],[33,141,33,144],[34,141,34,144],[36,135,36,140],[41,141,41,144],[42,141,42,144],[42,135,42,140],[37,135,37,140],[34,135,34,140],[35,135,35,140],[38,71,38,75],[38,76,38,84],[39,71,39,75],[39,76,39,84],[40,71,40,75],[40,76,40,84],[32,76,32,84],[33,71,33,75],[33,76,33,84],[34,71,34,75],[34,76,34,84],[32,145,32,150],[33,145,33,150],[34,145,34,150],[38,145,38,150],[39,145,39,150],[40,145,40,150],[35,145,35,150],[36,145,36,150],[37,145,37,150],[23,161,23,164],[24,161,24,164],[25,161,25,164],[41,145,41,150],[42,145,42,150],[43,145,43,150],[26,161,26,164],[27,161,27,164],[28,161,28,164],[23,155,23,160],[24,155,24,160],[25,155,25,160],[23,151,23,154],[24,151,24,154],[25,151,25,154],[25,145,25,150],[29,145,29,150],[30,145,30,150],[31,145,31,150],[29,161,29,164],[30,161,30,164],[31,161,31,164],[38,161,38,164],[33,161,33,164],[34,161,34,164],[35,161,35,164],[32,161,32,164],[35,155,35,160],[43,161,43,164],[44,161,44,164],[42,155,42,160],[43,155,43,160],[44,155,44,160],[39,155,39,160],[46,161,46,164],[23,165,23,170],[24,165,24,170],[25,165,25,170],[51,155,51,160],[52,155,52,160],[53,155,53,160],[32,165,32,170],[29,165,29,170],[30,165,30,170],[31,165,31,170],[26,165,26,170],[27,165,27,170],[28,165,28,170],[36,165,36,170],[37,165,37,170],[38,165,38,170],[33,165,33,170],[34,165,34,170],[35,165,35,170],[46,165,46,170],[43,165,43,170],[44,165,44,170],[45,165,45,170],[26,155,26,160],[32,57,32,61],[32,62,32,70],[33,57,33,61],[33,62,33,70],[34,57,34,61],[34,62,34,70],[35,57,35,61],[35,62,35,70],[31,57,31,61],[31,62,31,70],[26,71,26,75],[26,76,26,84],[27,71,27,75],[27,76,27,84],[28,71,28,75],[28,76,28,84],[29,71,29,75],[29,76,29,84],[30,71,30,75],[30,76,30,84],[31,71,31,75],[31,76,31,84],[32,71,32,75],[45,57,45,61],[46,57,46,61],[47,57,47,61],[48,57,48,61],[49,57,49,61],[52,57,52,61],[36,57,36,61],[36,62,36,70],[37,57,37,61],[37,62,37,70],[38,57,38,61],[38,62,38,70],[39,57,39,61],[39,62,39,70],[45,62,45,70],[46,62,46,70],[47,62,47,70],[48,62,48,70],[49,62,49,70],[50,57,50,61],[50,62,50,70],[51,57,51,61],[51,62,51,70],[52,62,52,70],[35,71,35,75],[35,76,35,84],[40,111,40,114],[41,111,41,114],[42,111,42,114],[43,111,43,114],[44,111,44,114],[45,111,45,114],[46,111,46,114],[46,71,46,75],[46,76,46,84],[43,85,43,89],[43,90,43,98],[44,85,44,89],[44,90,44,98],[45,85,45,89],[45,90,45,98],[38,90,38,98],[39,85,39,89],[39,90,39,98],[40,85,40,89],[40,90,40,98],[22,111,22,114],[33,111,33,114],[34,111,34,114],[35,111,35,114],[36,111,36,114],[37,111,37,114],[38,111,38,114],[39,111,39,114],[26,145,26,150],[27,145,27,150],[28,145,28,150],[22,121,22,124],[22,125,22,130],[23,135,23,140],[24,135,24,140],[38,135,38,140],[39,135,39,140],[31,135,31,140],[32,135,32,140],[33,135,33,140],[29,135,29,140],[30,135,30,140],[26,131,26,134],[27,131,27,134],[26,151,26,154],[27,151,27,154],[28,151,28,154],[28,135,28,140],[36,151,36,154],[51,71,51,75],[51,76,51,84],[49,71,49,75],[49,76,49,84],[50,71,50,75],[50,76,50,84],[41,71,41,75],[41,76,41,84],[42,71,42,75],[42,76,42,84],[43,71,43,75],[43,76,43,84],[44,71,44,75],[44,76,44,84],[45,71,45,75],[45,76,45,84],[43,121,43,124],[43,125,43,130],[44,121,44,124],[28,131,28,134],[53,131,53,134],[23,141,23,144],[24,141,24,144],[25,141,25,144],[26,141,26,144],[27,141,27,144],[28,141,28,144],[29,141,29,144],[30,141,30,144],[31,141,31,144],[32,141,32,144],[25,135,25,140],[26,135,26,140],[27,135,27,140],[51,131,51,134],[51,135,51,140],[52,131,52,134],[52,135,52,140],[47,141,47,144],[48,141,48,144],[37,141,37,144],[44,141,44,144],[45,141,45,144],[45,161,45,164],[67,63,67,83],[67,84,67,101],[0,0,1,53],[39,161,39,164],[39,165,39,170],[40,161,40,164],[40,165,40,170],[41,161,41,164],[41,165,41,170],[30,151,30,154],[30,155,30,160],[31,151,31,154],[31,155,31,160],[27,155,27,160],[28,155,28,160],[36,161,36,164],[37,161,37,164],[22,141,22,144],[32,151,32,154],[33,151,33,154],[34,151,34,154],[35,151,35,154],[22,131,22,134],[63,0,63,26],[64,0,64,26],[65,0,65,26],[67,0,67,14],[67,15,67,26],[3,62,3,83],[3,84,3,99],[4,62,4,83],[4,84,4,99],[5,62,5,83],[3,0,3,12],[3,13,3,58],[4,13,4,58],[5,13,5,58],[52,71,52,75],[52,76,52,84],[47,71,47,75],[47,76,47,84],[48,71,48,75],[48,76,48,84],[36,71,36,75],[36,76,36,84],[37,71,37,75],[37,76,37,84]]}
[{"$f":"IF(Data!$AE$2=\"DE\",\"Messprotokoll\",IF(Data!$AE$2=\"UK\",\"Measurement protocol\",IF(Data!$AE$2=\"FR\",\"Rapport de mesure\",\"Language Error\")))","v":"Measurement protocol"}]
[]
[]
[{"$f":"IF(Data!$AE$2 = \"DE\", \"Prüfling:\", IF(Data!$AE$2 = \"UK\",\"Test object:\",IF(Data!$AE$2=\"FR\",\"Objet testé:\",\"Language Error\")))","v":"Test object:"},null,null,null,null,null,null,null,null,null,null,null,null,{"$f":"'Protocol 1 (5nm)'!N4:BG4","v":"Manufacturer"},null,null,null,null,null,null,null,null,null,null,null,null,null,null,null,null,null,null,null,null,null,null,null,null,null,null,null,null,null,null,null,null,null,null,null,null,null,null,null,null,null,null,null,null,null,null,null,null,{"$f":"IF(Data!$AE$2=\"DE\",\"Messdatei:\",IF(Data!$AE$2=\"UK\",\"Measurement file:\",IF(Data!$AE$2=\"FR\",\"Fichier de mesure:\",\"Language Error\")))","v":"Measurement file:"},null,null,null,null,null,null,null,null,null,null,null,null,null,null,null,null,null,null,null,null,null,{"$f":"Data!Q18","v":"Measured"}]
[null,null,null,null,null,null,null,null,null,null,null,null,null,{"$f":"'Protocol 1 (5nm)'!N5:BG5","v":"Type"},null,null,null,null,null,null,null,null,null,null,null,null,null,null,null,null,null,null,null,null,null,null,null,null,null,null,null,null,null,null,null,null,null,null,null,null,null,null,null,null,null,null,null,null,null,null,null,null,{"$f":"IF(Data!$AE$2=\"DE\",\"Datum der Messung:\",IF(Data!$AE$2=\"UK\",\"Date of measurement:\",IF(Data!$AE$2=\"FR\",\"Date de mesure:\",\"Language Error\")))","v":"Date of measurement:"},null,null,null,null,null,null,null,null,null,null,null,null,null,null,null,null,null,null,null,null,null,{"$f":"Data!Q23","v":"29.09.2021"}]
[null,null,null,null,null,null,null,null,null,null,null,null,null,{"$f":"'Protocol 1 (5nm)'!N6:BG6","v":"Model"},null,null,null,null,null,null,null,null,null,null,null,null,null,null,null,null,null,null,null,null,null,null,null,null,null,null,null,null,null,null,null,null,null,null,null,null,null,null,null,null,null,null,null,null,null,null,null,null,{"$f":"IF(Data!$AE$2=\"DE\",\"Uhrzeit der Messung:\",IF(Data!$AE$2=\"UK\",\"Time of measurement:\",IF(Data!$AE$2=\"FR\",\"Heure de mesure:\",\"Language Error\")))","v":"Time of measurement:"},null,null,null,null,null,null,null,null,null,null,null,null,null,null,null,null,null,null,null,null,null,{"$f":"Data!Q21","v":"10:06:00"}]
[]
[]
[]
[]
[]
[]
[]
[]
[]
[]
[]
[]
[]
[]
[]
[null,"[nm]",null,null,null,null,"mW/m²/nm",null,null,null,null,null,null,null,null,"[nm]",null,null,null,null,"mW/m²/nm",null,null,null,null,null,null,null,null,"[nm]",null,null,null,null,"mW/m²/nm",null,null,null,null,null,null,null,null,"[nm]",null,null,null,null,"mW/m²/nm",null,null,null,null,null,null,null,null,"[nm]",null,null,null,null,"mW/m²/nm",null,null,null,null,null,null,null,null,"[nm]",null,null,null,null,"mW/m²/nm",null,null,null,null,null,null,null,null,"[nm]",null,null,null,null,"mW/m²/nm"]
[null,{"$f":"Data!$G1","v":380},null,null,null,null,{"$f":"Data!$H1","v":1.7470250000000001},null,null,null,null,null,null,null,null,{"$f":"Data!$G32","v":535},null,null,null,null,{"$f":"Data!$H32","v":17.530825},null,null,null,null,null,null,null,null,{"$f":"IF(Data!$G63=\"\",\"\",Data!$G63)","v":690},null,null,null,null,{"$f":"IF(Data!$H63=\"\",\"\",Data!$H63)","v":13.662929999999999},null,null,null,null,null,null,null,null,{"$f":"IF(Data!$G94=\"\",\"\",Data!$G94)","v":""},null,null,null,null,{"$f":"IF(Data!$H94=\"\",\"\",Data!$H94)","v":""},null,null,null,null,null,null,null,null,{"$f":"IF(Data!$G125=\"\",\"\",Data!$G125)","v":""},null,null,null,null,{"$f":"IF(Data!$H125=\"\",\"\",Data!$H125)","v":""},null,null,null,null,null,null,null,null,{"$f":"IF(Data!$G156=\"\",\"\",Data!$G156)","v":""},null,null,null,null,{"$f":"IF(Data!$H156=\"\",\"\",Data!$H156)","v":""},null,null,null,null,null,null,null,null,{"$f":"IF(Data!$G187=\"\",\"\",Data!$G187)","v":""},null,null,null,null,{"$f":"IF(Data!$H187=\"\",\"\",Data!$H187)","v":""}]
[null,{"$f":"Data!$G2","v":385},null,null,null,null,{"$f":"Data!$H2","v":1.9551480000000001},null,null,null,null,null,null,null,null,{"$f":"Data!$G33","v":540},null,null,null,null,{"$f":"Data!$H33","v":17.427284},null,null,null,null,null,null,null,null,{"$f":"IF(Data!$G64=\"\",\"\",Data!$G64)","v":695},null,null,null,null,{"$f":"IF(Data!$H64=\"\",\"\",Data!$H64)","v":14.074071},null,null,null,null,null,null,null,null,{"$f":"IF(Data!$G95=\"\",\"\",Data!$G95)","v":""},null,null,null,null,{"$f":"IF(Data!$H95=\"\",\"\",Data!$H95)","v":""},null,null,null,null,null,null,null,null,{"$f":"IF(Data!$G126=\"\",\"\",Data!$G126)","v":""},null,null,null,null,{"$f":"IF(Data!$H126=\"\",\"\",Data!$H126)","v":""},null,null,null,null,null,null,null,null,{"$f":"IF(Data!$G157=\"\",\"\",Data!$G157)","v":""},null,null,null,null,{"$f":"IF(Data!$H157=\"\",\"\",Data!$H157)","v":""},null,null,null,null,null,null,null,null,{"$f":"IF(Data!$G188=\"\",\"\",Data!$G188)","v":""},null,null,null,null,{"$f":"IF(Data!$H188=\"\",\"\",Data!$H188)","v":""}]
[null,{"$f":"Data!$G3","v":390},null,null,null,null,{"$f":"Data!$H3","v":2.3422209999999999},null,null,null,null,null,null,null,null,{"$f":"Data!$G34","v":545},null,null,null,null,{"$f":"Data!$H34","v":17.464561},null,null,null,null,null,null,null,null,{"$f":"IF(Data!$G65=\"\",\"\",Data!$G65)","v":700},null,null,null,null,{"$f":"IF(Data!$H65=\"\",\"\",Data!$H65)","v":14.629459000000001},null,null,null,null,null,null,null,null,{"$f":"IF(Data!$G96=\"\",\"\",Data!$G96)","v":""},null,null,null,null,{"$f":"IF(Data!$H96=\"\",\"\",Data!$H96)","v":""},null,null,null,null,null,null,null,null,{"$f":"IF(Data!$G127=\"\",\"\",Data!$G127)","v":""},null,null,null,null,{"$f":"IF(Data!$H127=\"\",\"\",Data!$H127)","v":""},null,null,null,null,null,null,null,null,{"$f":"IF(Data!$G158=\"\",\"\",Data!$G158)","v":""},null,null,null,null,{"$f":"IF(Data!$H158=\"\",\"\",Data!$H158)","v":""},null,null,null,null,null,null,null,null,{"$f":"IF(Data!$G189=\"\",\"\",Data!$G189)","v":""},null,null,null,null,{"$f":"IF(Data!$H189=\"\",\"\",Data!$H189)","v":""}]
[null,{"$f":"Data!$G4","v":395},null,null,null,null,{"$f":"Data!$H4","v":3.0443509999999998},null,null,null,null,null,null,null,null,{"$f":"Data!$G35","v":550},null,null,null,null,{"$f":"Data!$H35","v":17.491382999999999},null,null,null,null,null,null,null,null,{"$f":"IF(Data!$G66=\"\",\"\",Data!$G66)","v":705},null,null,null,null,{"$f":"IF(Data!$H66=\"\",\"\",Data!$H66)","v":15.202375},null,null,null,null,null,null,null,null,{"$f":"IF(Data!$G97=\"\",\"\",Data!$G97)","v":""},null,null,null,null,{"$f":"IF(Data!$H97=\"\",\"\",Data!$H97)","v":""},null,null,null,null,null,null,null,null,{"$f":"IF(Data!$G128=\"\",\"\",Data!$G128)","v":""},null,null,null,null,{"$f":"IF(Data!$H128=\"\",\"\",Data!$H128)","v":""},null,null,null,null,null,null,null,null,{"$f":"IF(Data!$G159=\"\",\"\",Data!$G159)","v":""},null,null,null,null,{"$f":"IF(Data!$H159=\"\",\"\",Data!$H159)","v":""},null,null,null,null,null,null,null,null,{"$f":"IF(Data!$G190=\"\",\"\",Data!$G190)","v":""},null,null,null,null,{"$f":"IF(Data!$H190=\"\",\"\",Data!$H190)","v":""}]
[null,{"$f":"Data!$G5","v":400},null,null,null,null,{"$f":"Data!$H5","v":4.4780259999999998},null,null,null,null,null,null,null,null,{"$f":"Data!$G36","v":555},null,null,null,null,{"$f":"Data!$H36","v":17.440124999999998},null,null,null,null,null,null,null,null,{"$f":"IF(Data!$G67=\"\",\"\",Data!$G67)","v":710},null,null,null,null,{"$f":"IF(Data!$H67=\"\",\"\",Data!$H67)","v":15.358993999999999},null,null,null,null,null,null,null,null,{"$f":"IF(Data!$G98=\"\",\"\",Data!$G98)","v":""},null,null,null,null,{"$f":"IF(Data!$H98=\"\",\"\",Data!$H98)","v":""},null,null,null,null,null,null,null,null,{"$f":"IF(Data!$G129=\"\",\"\",Data!$G129)","v":""},null,null,null,null,{"$f":"IF(Data!$H129=\"\",\"\",Data!$H129)","v":""},null,null,null,null,null,null,null,null,{"$f":"IF(Data!$G160=\"\",\"\",Data!$G160)","v":""},null,null,null,null,{"$f":"IF(Data!$H160=\"\",\"\",Data!$H160)","v":""},null,null,null,null,null,null,null,null,{"$f":"IF(Data!$G191=\"\",\"\",Data!$G191)","v":""},null,null,null,null,{"$f":"IF(Data!$H191=\"\",\"\",Data!$H191)","v":""}]
[null,{"$f":"Data!$G6","v":405},null,null,null,null,{"$f":"Data!$H6","v":5.9537769999999997},null,null,null,null,null,null,null,null,{"$f":"Data!$G37","v":560},null,null,null,null,{"$f":"Data!$H37","v":17.214663000000002},null,null,null,null,null,null,null,null,{"$f":"IF(Data!$G68=\"\",\"\",Data!$G68)","v":715},null,null,null,null,{"$f":"IF(Data!$H68=\"\",\"\",Data!$H68)","v":14.246861000000001},null,null,null,null,null,null,null,null,{"$f":"IF(Data!$G99=\"\",\"\",Data!$G99)","v":""},null,null,null,null,{"$f":"IF(Data!$H99=\"\",\"\",Data!$H99)","v":""},null,null,null,null,null,null,null,null,{"$f":"IF(Data!$G130=\"\",\"\",Data!$G130)","v":""},null,null,null,null,{"$f":"IF(Data!$H130=\"\",\"\",Data!$H130)","v":""},null,null,null,null,null,null,null,null,{"$f":"IF(Data!$G161=\"\",\"\",Data!$G161)","v":""},null,null,null,null,{"$f":"IF(Data!$H161=\"\",\"\",Data!$H161)","v":""},null,null,null,null,null,null,null,null,{"$f":"IF(Data!$G192=\"\",\"\",Data!$G192)","v":""},null,null,null,null,{"$f":"IF(Data!$H192=\"\",\"\",Data!$H192)","v":""}]
[null,{"$f":"Data!$G7","v":410},null,null,null,null,{"$f":"Data!$H7","v":6.9295419999999996},null,null,null,null,null,null,null,null,{"$f":"Data!$G38","v":565},null,null,null,null,{"$f":"Data!$H38","v":16.857655000000001},null,null,null,null,null,null,null,null,{"$f":"IF(Data!$G69=\"\",\"\",Data!$G69)","v":720},null,null,null,null,{"$f":"IF(Data!$H69=\"\",\"\",Data!$H69)","v":13.123232},null,null,null,null,null,null,null,null,{"$f":"IF(Data!$G100=\"\",\"\",Data!$G100)","v":""},null,null,null,null,{"$f":"IF(Data!$H100=\"\",\"\",Data!$H100)","v":""},null,null,null,null,null,null,null,null,{"$f":"IF(Data!$G131=\"\",\"\",Data!$G131)","v":""},null,null,null,null,{"$f":"IF(Data!$H131=\"\",\"\",Data!$H131)","v":""},null,null,null,null,null,null,null,null,{"$f":"IF(Data!$G162=\"\",\"\",Data!$G162)","v":""},null,null,null,null,{"$f":"IF(Data!$H162=\"\",\"\",Data!$H162)","v":""},null,null,null,null,null,null,null,null,{"$f":"IF(Data!$G193=\"\",\"\",Data!$G193)","v":""},null,null,null,null,{"$f":"IF(Data!$H193=\"\",\"\",Data!$H193)","v":""}]
[null,{"$f":"Data!$G8","v":415},null,null,null,null,{"$f":"Data!$H8","v":8.1653699999999994},null,null,null,null,null,null,null,null,{"$f":"Data!$G39","v":570},null,null,null,null,{"$f":"Data!$H39","v":16.620396},null,null,null,null,null,null,null,null,{"$f":"IF(Data!$G70=\"\",\"\",Data!$G70)","v":725},null,null,null,null,{"$f":"IF(Data!$H70=\"\",\"\",Data!$H70)","v":13.262581000000001},null,null,null,null,null,null,null,null,{"$f":"IF(Data!$G101=\"\",\"\",Data!$G101)","v":""},null,null,null,null,{"$f":"IF(Data!$H101=\"\",\"\",Data!$H101)","v":""},null,null,null,null,null,null,null,null,{"$f":"IF(Data!$G132=\"\",\"\",Data!$G132)","v":""},null,null,null,null,{"$f":"IF(Data!$H132=\"\",\"\",Data!$H132)","v":""},null,null,null,null,null,null,null,null,{"$f":"IF(Data!$G163=\"\",\"\",Data!$G163)","v":""},null,null,null,null,{"$f":"IF(Data!$H163=\"\",\"\",Data!$H163)","v":""},null,null,null,null,null,null,null,null,{"$f":"IF(Data!$G194=\"\",\"\",Data!$G194)","v":""},null,null,null,null,{"$f":"IF(Data!$H194=\"\",\"\",Data!$H194)","v":""}]
[null,{"$f":"Data!$G9","v":420},null,null,null,null,{"$f":"Data!$H9","v":8.8666110000000007},null,null,null,null,null,null,null,null,{"$f":"Data!$G40","v":575},null,null,null,null,{"$f":"Data!$H40","v":16.517523000000001},null,null,null,null,null,null,null,null,{"$f":"IF(Data!$G71=\"\",\"\",Data!$G71)","v":730},null,null,null,null,{"$f":"IF(Data!$H71=\"\",\"\",Data!$H71)","v":14.46374},null,null,null,null,null,null,null,null,{"$f":"IF(Data!$G102=\"\",\"\",Data!$G102)","v":""},null,null,null,null,{"$f":"IF(Data!$H102=\"\",\"\",Data!$H102)","v":""},null,null,null,null,null,null,null,null,{"$f":"IF(Data!$G133=\"\",\"\",Data!$G133)","v":""},null,null,null,null,{"$f":"IF(Data!$H133=\"\",\"\",Data!$H133)","v":""},null,null,null,null,null,null,null,null,{"$f":"IF(Data!$G164=\"\",\"\",Data!$G164)","v":""},null,null,null,null,{"$f":"IF(Data!$H164=\"\",\"\",Data!$H164)","v":""},null,null,null,null,null,null,null,null,{"$f":"IF(Data!$G195=\"\",\"\",Data!$G195)","v":""},null,null,null,null,{"$f":"IF(Data!$H195=\"\",\"\",Data!$H195)","v":""}]
[null,{"$f":"Data!$G10","v":425},null,null,null,null,{"$f":"Data!$H10","v":9.1403680000000005},null,null,null,null,null,null,null,null,{"$f":"Data!$G41","v":580},null,null,null,null,{"$f":"Data!$H41","v":16.530363000000001},null,null,null,null,null,null,null,null,{"$f":"IF(Data!$G72=\"\",\"\",Data!$G72)","v":735},null,null,null,null,{"$f":"IF(Data!$H72=\"\",\"\",Data!$H72)","v":16.200191},null,null,null,null,null,null,null,null,{"$f":"IF(Data!$G103=\"\",\"\",Data!$G103)","v":""},null,null,null,null,{"$f":"IF(Data!$H103=\"\",\"\",Data!$H103)","v":""},null,null,null,null,null,null,null,null,{"$f":"IF(Data!$G134=\"\",\"\",Data!$G134)","v":""},null,null,null,null,{"$f":"IF(Data!$H134=\"\",\"\",Data!$H134)","v":""},null,null,null,null,null,null,null,null,{"$f":"IF(Data!$G165=\"\",\"\",Data!$G165)","v":""},null,null,null,null,{"$f":"IF(Data!$H165=\"\",\"\",Data!$H165)","v":""},null,null,null,null,null,null,null,null,{"$f":"IF(Data!$G196=\"\",\"\",Data!$G196)","v":""},null,null,null,null,{"$f":"IF(Data!$H196=\"\",\"\",Data!$H196)","v":""}]
[null,{"$f":"Data!$G11","v":430},null,null,null,null,{"$f":"Data!$H11","v":9.2625890000000002},null,null,null,null,null,null,null,null,{"$f":"Data!$G42","v":585},null,null,null,null,{"$f":"Data!$H42","v":16.294405000000001},null,null,null,null,null,null,null,null,{"$f":"IF(Data!$G73=\"\",\"\",Data!$G73)","v":740},null,null,null,null,{"$f":"IF(Data!$H73=\"\",\"\",Data!$H73)","v":17.517562999999999},null,null,null,null,null,null,null,null,{"$f":"IF(Data!$G104=\"\",\"\",Data!$G104)","v":""},null,null,null,null,{"$f":"IF(Data!$H104=\"\",\"\",Data!$H104)","v":""},null,null,null,null,null,null,null,null,{"$f":"IF(Data!$G135=\"\",\"\",Data!$G135)","v":""},null,null,null,null,{"$f":"IF(Data!$H135=\"\",\"\",Data!$H135)","v":""},null,null,null,null,null,null,null,null,{"$f":"IF(Data!$G166=\"\",\"\",Data!$G166)","v":""},null,null,null,null,{"$f":"IF(Data!$H166=\"\",\"\",Data!$H166)","v":""},null,null,null,null,null,null,null,null,{"$f":"IF(Data!$G197=\"\",\"\",Data!$G197)","v":""},null,null,null,null,{"$f":"IF(Data!$H197=\"\",\"\",Data!$H197)","v":""}]
[null,{"$f":"Data!$G12","v":435},null,null,null,null,{"$f":"Data!$H12","v":10.222623},null,null,null,null,null,null,null,null,{"$f":"Data!$G43","v":590},null,null,null,null,{"$f":"Data!$H43","v":15.751006},null,null,null,null,null,null,null,null,{"$f":"IF(Data!$G74=\"\",\"\",Data!$G74)","v":745},null,null,null,null,{"$f":"IF(Data!$H74=\"\",\"\",Data!$H74)","v":18.14922},null,null,null,null,null,null,null,null,{"$f":"IF(Data!$G105=\"\",\"\",Data!$G105)","v":""},null,null,null,null,{"$f":"IF(Data!$H105=\"\",\"\",Data!$H105)","v":""},null,null,null,null,null,null,null,null,{"$f":"IF(Data!$G136=\"\",\"\",Data!$G136)","v":""},null,null,null,null,{"$f":"IF(Data!$H136=\"\",\"\",Data!$H136)","v":""},null,null,null,null,null,null,null,null,{"$f":"IF(Data!$G167=\"\",\"\",Data!$G167)","v":""},null,null,null,null,{"$f":"IF(Data!$H167=\"\",\"\",Data!$H167)","v":""},null,null,null,null,null,null,null,null,{"$f":"IF(Data!$G198=\"\",\"\",Data!$G198)","v":""},null,null,null,null,{"$f":"IF(Data!$H198=\"\",\"\",Data!$H198)","v":""}]
[null,{"$f":"Data!$G13","v":440},null,null,null,null,{"$f":"Data!$H13","v":11.434519999999999},null,null,null,null,null,null,null,null,{"$f":"Data!$G44","v":595},null,null,null,null,{"$f":"Data!$H44","v":15.803174},null,null,null,null,null,null,null,null,{"$f":"IF(Data!$G75=\"\",\"\",Data!$G75)","v":750},null,null,null,null,{"$f":"IF(Data!$H75=\"\",\"\",Data!$H75)","v":18.020264000000001},null,null,null,null,null,null,null,null,{"$f":"IF(Data!$G106=\"\",\"\",Data!$G106)","v":""},null,null,null,null,{"$f":"IF(Data!$H106=\"\",\"\",Data!$H106)","v":""},null,null,null,null,null,null,null,null,{"$f":"IF(Data!$G137=\"\",\"\",Data!$G137)","v":""},null,null,null,null,{"$f":"IF(Data!$H137=\"\",\"\",Data!$H137)","v":""},null,null,null,null,null,null,null,null,{"$f":"IF(Data!$G168=\"\",\"\",Data!$G168)","v":""},null,null,null,null,{"$f":"IF(Data!$H168=\"\",\"\",Data!$H168)","v":""},null,null,null,null,null,null,null,null,{"$f":"IF(Data!$G199=\"\",\"\",Data!$G199)","v":""},null,null,null,null,{"$f":"IF(Data!$H199=\"\",\"\",Data!$H199)","v":""}]
[null,{"$f":"Data!$G14","v":445},null,null,null,null,{"$f":"Data!$H14","v":12.582395999999999},null,null,null,null,null,null,null,null,{"$f":"Data!$G45","v":600},null,null,null,null,{"$f":"Data!$H45","v":16.115704000000001},null,null,null,null,null,null,null,null,{"$f":"IF(Data!$G76=\"\",\"\",Data!$G76)","v":755},null,null,null,null,{"$f":"IF(Data!$H76=\"\",\"\",Data!$H76)","v":15.876512999999999},null,null,null,null,null,null,null,null,{"$f":"IF(Data!$G107=\"\",\"\",Data!$G107)","v":""},null,null,null,null,{"$f":"IF(Data!$H107=\"\",\"\",Data!$H107)","v":""},null,null,null,null,null,null,null,null,{"$f":"IF(Data!$G138=\"\",\"\",Data!$G138)","v":""},null,null,null,null,{"$f":"IF(Data!$H138=\"\",\"\",Data!$H138)","v":""},null,null,null,null,null,null,null,null,{"$f":"IF(Data!$G169=\"\",\"\",Data!$G169)","v":""},null,null,null,null,{"$f":"IF(Data!$H169=\"\",\"\",Data!$H169)","v":""},null,null,null,null,null,null,null,null,{"$f":"IF(Data!$G200=\"\",\"\",Data!$G200)","v":""},null,null,null,null,{"$f":"IF(Data!$H200=\"\",\"\",Data!$H200)","v":""}]
[null,{"$f":"Data!$G15","v":450},null,null,null,null,{"$f":"Data!$H15","v":13.676095},null,null,null,null,null,null,null,null,{"$f":"Data!$G46","v":605},null,null,null,null,{"$f":"Data!$H46","v":16.306222999999999},null,null,null,null,null,null,null,null,{"$f":"IF(Data!$G77=\"\",\"\",Data!$G77)","v":760},null,null,null,null,{"$f":"IF(Data!$H77=\"\",\"\",Data!$H77)","v":12.366732000000001},null,null,null,null,null,null,null,null,{"$f":"IF(Data!$G108=\"\",\"\",Data!$G108)","v":""},null,null,null,null,{"$f":"IF(Data!$H108=\"\",\"\",Data!$H108)","v":""},null,null,null,null,null,null,null,null,{"$f":"IF(Data!$G139=\"\",\"\",Data!$G139)","v":""},null,null,null,null,{"$f":"IF(Data!$H139=\"\",\"\",Data!$H139)","v":""},null,null,null,null,null,null,null,null,{"$f":"IF(Data!$G170=\"\",\"\",Data!$G170)","v":""},null,null,null,null,{"$f":"IF(Data!$H170=\"\",\"\",Data!$H170)","v":""},null,null,null,null,null,null,null,null,{"$f":"IF(Data!$G201=\"\",\"\",Data!$G201)","v":""},null,null,null,null,{"$f":"IF(Data!$H201=\"\",\"\",Data!$H201)","v":""}]
[null,{"$f":"Data!$G16","v":455},null,null,null,null,{"$f":"Data!$H16","v":14.475695},null,null,null,null,null,null,null,null,{"$f":"Data!$G47","v":610},null,null,null,null,{"$f":"Data!$H47","v":16.259893000000002},null,null,null,null,null,null,null,null,{"$f":"IF(Data!$G78=\"\",\"\",Data!$G78)","v":765},null,null,null,null,{"$f":"IF(Data!$H78=\"\",\"\",Data!$H78)","v":12.548769999999999},null,null,null,null,null,null,null,null,{"$f":"IF(Data!$G109=\"\",\"\",Data!$G109)","v":""},null,null,null,null,{"$f":"IF(Data!$H109=\"\",\"\",Data!$H109)","v":""},null,null,null,null,null,null,null,null,{"$f":"IF(Data!$G140=\"\",\"\",Data!$G140)","v":""},null,null,null,null,{"$f":"IF(Data!$H140=\"\",\"\",Data!$H140)","v":""},null,null,null,null,null,null,null,null,{"$f":"IF(Data!$G171=\"\",\"\",Data!$G171)","v":""},null,null,null,null,{"$f":"IF(Data!$H171=\"\",\"\",Data!$H171)","v":""},null,null,null,null,null,null,null,null,{"$f":"IF(Data!$G202=\"\",\"\",Data!$G202)","v":""},null,null,null,null,{"$f":"IF(Data!$H202=\"\",\"\",Data!$H202)","v":""}]
[null,{"$f":"Data!$G17","v":460},null,null,null,null,{"$f":"Data!$H17","v":14.90868},null,null,null,null,null,null,null,null,{"$f":"Data!$G48","v":615},null,null,null,null,{"$f":"Data!$H48","v":16.116161000000002},null,null,null,null,null,null,null,null,{"$f":"IF(Data!$G79=\"\",\"\",Data!$G79)","v":770},null,null,null,null,{"$f":"IF(Data!$H79=\"\",\"\",Data!$H79)","v":15.813597},null,null,null,null,null,null,null,null,{"$f":"IF(Data!$G110=\"\",\"\",Data!$G110)","v":""},null,null,null,null,{"$f":"IF(Data!$H110=\"\",\"\",Data!$H110)","v":""},null,null,null,null,null,null,null,null,{"$f":"IF(Data!$G141=\"\",\"\",Data!$G141)","v":""},null,null,null,null,{"$f":"IF(Data!$H141=\"\",\"\",Data!$H141)","v":""},null,null,null,null,null,null,null,null,{"$f":"IF(Data!$G172=\"\",\"\",Data!$G172)","v":""},null,null,null,null,{"$f":"IF(Data!$H172=\"\",\"\",Data!$H172)","v":""},null,null,null,null,null,null,null,null,{"$f":"IF(Data!$G203=\"\",\"\",Data!$G203)","v":""},null,null,null,null,{"$f":"IF(Data!$H203=\"\",\"\",Data!$H203)","v":""}]
[null,{"$f":"Data!$G18","v":465},null,null,null,null,{"$f":"Data!$H18","v":15.160750999999999},null,null,null,null,null,null,null,null,{"$f":"Data!$G49","v":620},null,null,null,null,{"$f":"Data!$H49","v":16.033514},null,null,null,null,null,null,null,null,{"$f":"IF(Data!$G80=\"\",\"\",Data!$G80)","v":775},null,null,null,null,{"$f":"IF(Data!$H80=\"\",\"\",Data!$H80)","v":17.428082},null,null,null,null,null,null,null,null,{"$f":"IF(Data!$G111=\"\",\"\",Data!$G111)","v":""},null,null,null,null,{"$f":"IF(Data!$H111=\"\",\"\",Data!$H111)","v":""},null,null,null,null,null,null,null,null,{"$f":"IF(Data!$G142=\"\",\"\",Data!$G142)","v":""},null,null,null,null,{"$f":"IF(Data!$H142=\"\",\"\",Data!$H142)","v":""},null,null,null,null,null,null,null,null,{"$f":"IF(Data!$G173=\"\",\"\",Data!$G173)","v":""},null,null,null,null,{"$f":"IF(Data!$H173=\"\",\"\",Data!$H173)","v":""},null,null,null,null,null,null,null,null,{"$f":"IF(Data!$G204=\"\",\"\",Data!$G204)","v":""},null,null,null,null,{"$f":"IF(Data!$H204=\"\",\"\",Data!$H204)","v":""}]
[null,{"$f":"Data!$G19","v":470},null,null,null,null,{"$f":"Data!$H19","v":15.360201},null,null,null,null,null,null,null,null,{"$f":"Data!$G50","v":625},null,null,null,null,{"$f":"Data!$H50","v":15.820515},null,null,null,null,null,null,null,null,{"$f":"IF(Data!$G81=\"\",\"\",Data!$G81)","v":780},null,null,null,null,{"$f":"IF(Data!$H81=\"\",\"\",Data!$H81)","v":17.473745000000001},null,null,null,null,null,null,null,null,{"$f":"IF(Data!$G112=\"\",\"\",Data!$G112)","v":""},null,null,null,null,{"$f":"IF(Data!$H112=\"\",\"\",Data!$H112)","v":""},null,null,null,null,null,null,null,null,{"$f":"IF(Data!$G143=\"\",\"\",Data!$G143)","v":""},null,null,null,null,{"$f":"IF(Data!$H143=\"\",\"\",Data!$H143)","v":""},null,null,null,null,null,null,null,null,{"$f":"IF(Data!$G174=\"\",\"\",Data!$G174)","v":""},null,null,null,null,{"$f":"IF(Data!$H174=\"\",\"\",Data!$H174)","v":""},null,null,null,null,null,null,null,null,{"$f":"IF(Data!$G205=\"\",\"\",Data!$G205)","v":""},null,null,null,null,{"$f":"IF(Data!$H205=\"\",\"\",Data!$H205)","v":""}]
[null,{"$f":"Data!$G20","v":475},null,null,null,null,{"$f":"Data!$H20","v":15.666918000000001},null,null,null,null,null,null,null,null,{"$f":"Data!$G51","v":630},null,null,null,null,{"$f":"Data!$H51","v":15.616255000000001},null,null,null,null,null,null,null,null,{"$f":"IF(Data!$G82=\"\",\"\",Data!$G82)","v":""},null,null,null,null,{"$f":"IF(Data!$H82=\"\",\"\",Data!$H82)","v":""},null,null,null,null,null,null,null,null,{"$f":"IF(Data!$G113=\"\",\"\",Data!$G113)","v":""},null,null,null,null,{"$f":"IF(Data!$H113=\"\",\"\",Data!$H113)","v":""},null,null,null,null,null,null,null,null,{"$f":"IF(Data!$G144=\"\",\"\",Data!$G144)","v":""},null,null,null,null,{"$f":"IF(Data!$H144=\"\",\"\",Data!$H144)","v":""},null,null,null,null,null,null,null,null,{"$f":"IF(Data!$G175=\"\",\"\",Data!$G175)","v":""},null,null,null,null,{"$f":"IF(Data!$H175=\"\",\"\",Data!$H175)","v":""},null,null,null,null,null,null,null,null,{"$f":"IF(Data!$G206=\"\",\"\",Data!$G206)","v":""},null,null,null,null,{"$f":"IF(Data!$H206=\"\",\"\",Data!$H206)","v":""}]
[null,{"$f":"Data!$G21","v":480},null,null,null,null,{"$f":"Data!$H21","v":15.932422000000001},null,null,null,null,null,null,null,null,{"$f":"Data!$G52","v":635},null,null,null,null,{"$f":"Data!$H52","v":15.801816000000001},null,null,null,null,null,null,null,null,{"$f":"IF(Data!$G83=\"\",\"\",Data!$G83)","v":""},null,null,null,null,{"$f":"IF(Data!$H83=\"\",\"\",Data!$H83)","v":""},null,null,null,null,null,null,null,null,{"$f":"IF(Data!$G114=\"\",\"\",Data!$G114)","v":""},null,null,null,null,{"$f":"IF(Data!$H114=\"\",\"\",Data!$H114)","v":""},null,null,null,null,null,null,null,null,{"$f":"IF(Data!$G145=\"\",\"\",Data!$G145)","v":""},null,null,null,null,{"$f":"IF(Data!$H145=\"\",\"\",Data!$H145)","v":""},null,null,null,null,null,null,null,null,{"$f":"IF(Data!$G176=\"\",\"\",Data!$G176)","v":""},null,null,null,null,{"$f":"IF(Data!$H176=\"\",\"\",Data!$H176)","v":""},null,null,null,null,null,null,null,null,{"$f":"IF(Data!$G207=\"\",\"\",Data!$G207)","v":""},null,null,null,null,{"$f":"IF(Data!$H207=\"\",\"\",Data!$H207)","v":""}]
[null,{"$f":"Data!$G22","v":485},null,null,null,null,{"$f":"Data!$H22","v":15.754631},null,null,null,null,null,null,null,null,{"$f":"Data!$G53","v":640},null,null,null,null,{"$f":"Data!$H53","v":15.819179999999999},null,null,null,null,null,null,null,null,{"$f":"IF(Data!$G84=\"\",\"\",Data!$G84)","v":""},null,null,null,null,{"$f":"IF(Data!$H84=\"\",\"\",Data!$H84)","v":""},null,null,null,null,null,null,null,null,{"$f":"IF(Data!$G115=\"\",\"\",Data!$G115)","v":""},null,null,null,null,{"$f":"IF(Data!$H115=\"\",\"\",Data!$H115)","v":""},null,null,null,null,null,null,null,null,{"$f":"IF(Data!$G146=\"\",\"\",Data!$G146)","v":""},null,null,null,null,{"$f":"IF(Data!$H146=\"\",\"\",Data!$H146)","v":""},null,null,null,null,null,null,null,null,{"$f":"IF(Data!$G177=\"\",\"\",Data!$G177)","v":""},null,null,null,null,{"$f":"IF(Data!$H177=\"\",\"\",Data!$H177)","v":""},null,null,null,null,null,null,null,null,{"$f":"IF(Data!$G208=\"\",\"\",Data!$G208)","v":""},null,null,null,null,{"$f":"IF(Data!$H208=\"\",\"\",Data!$H208)","v":""}]
[null,{"$f":"Data!$G23","v":490},null,null,null,null,{"$f":"Data!$H23","v":15.870525000000001},null,null,null,null,null,null,null,null,{"$f":"Data!$G54","v":645},null,null,null,null,{"$f":"Data!$H54","v":15.523285},null,null,null,null,null,null,null,null,{"$f":"IF(Data!$G85=\"\",\"\",Data!$G85)","v":""},null,null,null,null,{"$f":"IF(Data!$H85=\"\",\"\",Data!$H85)","v":""},null,null,null,null,null,null,null,null,{"$f":"IF(Data!$G116=\"\",\"\",Data!$G116)","v":""},null,null,null,null,{"$f":"IF(Data!$H116=\"\",\"\",Data!$H116)","v":""},null,null,null,null,null,null,null,null,{"$f":"IF(Data!$G147=\"\",\"\",Data!$G147)","v":""},null,null,null,null,{"$f":"IF(Data!$H147=\"\",\"\",Data!$H147)","v":""},null,null,null,null,null,null,null,null,{"$f":"IF(Data!$G178=\"\",\"\",Data!$G178)","v":""},null,null,null,null,{"$f":"IF(Data!$H178=\"\",\"\",Data!$H178)","v":""},null,null,null,null,null,null,null,null,{"$f":"IF(Data!$G209=\"\",\"\",Data!$G209)","v":""},null,null,null,null,{"$f":"IF(Data!$H209=\"\",\"\",Data!$H209)","v":""}]
[null,{"$f":"Data!$G24","v":495},null,null,null,null,{"$f":"Data!$H24","v":16.288945999999999},null,null,null,null,null,null,null,null,{"$f":"Data!$G55","v":650},null,null,null,null,{"$f":"Data!$H55","v":15.154457000000001},null,null,null,null,null,null,null,null,{"$f":"IF(Data!$G86=\"\",\"\",Data!$G86)","v":""},null,null,null,null,{"$f":"IF(Data!$H86=\"\",\"\",Data!$H86)","v":""},null,null,null,null,null,null,null,null,{"$f":"IF(Data!$G117=\"\",\"\",Data!$G117)","v":""},null,null,null,null,{"$f":"IF(Data!$H117=\"\",\"\",Data!$H117)","v":""},null,null,null,null,null,null,null,null,{"$f":"IF(Data!$G148=\"\",\"\",Data!$G148)","v":""},null,null,null,null,{"$f":"IF(Data!$H148=\"\",\"\",Data!$H148)","v":""},null,null,null,null,null,null,null,null,{"$f":"IF(Data!$G179=\"\",\"\",Data!$G179)","v":""},null,null,null,null,{"$f":"IF(Data!$H179=\"\",\"\",Data!$H179)","v":""},null,null,null,null,null,null,null,null,{"$f":"IF(Data!$G210=\"\",\"\",Data!$G210)","v":""},null,null,null,null,{"$f":"IF(Data!$H210=\"\",\"\",Data!$H210)","v":""}]
[null,{"$f":"Data!$G25","v":500},null,null,null,null,{"$f":"Data!$H25","v":16.311502000000001},null,null,null,null,null,null,null,null,{"$f":"Data!$G56","v":655},null,null,null,null,{"$f":"Data!$H56","v":15.060684999999999},null,null,null,null,null,null,null,null,{"$f":"IF(Data!$G87=\"\",\"\",Data!$G87)","v":""},null,null,null,null,{"$f":"IF(Data!$H87=\"\",\"\",Data!$H87)","v":""},null,null,null,null,null,null,null,null,{"$f":"IF(Data!$G118=\"\",\"\",Data!$G118)","v":""},null,null,null,null,{"$f":"IF(Data!$H118=\"\",\"\",Data!$H118)","v":""},null,null,null,null,null,null,null,null,{"$f":"IF(Data!$G149=\"\",\"\",Data!$G149)","v":""},null,null,null,null,{"$f":"IF(Data!$H149=\"\",\"\",Data!$H149)","v":""},null,null,null,null,null,null,null,null,{"$f":"IF(Data!$G180=\"\",\"\",Data!$G180)","v":""},null,null,null,null,{"$f":"IF(Data!$H180=\"\",\"\",Data!$H180)","v":""},null,null,null,null,null,null,null,null,{"$f":"IF(Data!$G211=\"\",\"\",Data!$G211)","v":""},null,null,null,null,{"$f":"IF(Data!$H211=\"\",\"\",Data!$H211)","v":""}]
[null,{"$f":"Data!$G26","v":505},null,null,null,null,{"$f":"Data!$H26","v":16.393141},null,null,null,null,null,null,null,null,{"$f":"Data!$G57","v":660},null,null,null,null,{"$f":"Data!$H57","v":15.393768},null,null,null,null,null,null,null,null,{"$f":"IF(Data!$G88=\"\",\"\",Data!$G88)","v":""},null,null,null,null,{"$f":"IF(Data!$H88=\"\",\"\",Data!$H88)","v":""},null,null,null,null,null,null,null,null,{"$f":"IF(Data!$G119=\"\",\"\",Data!$G119)","v":""},null,null,null,null,{"$f":"IF(Data!$H119=\"\",\"\",Data!$H119)","v":""},null,null,null,null,null,null,null,null,{"$f":"IF(Data!$G150=\"\",\"\",Data!$G150)","v":""},null,null,null,null,{"$f":"IF(Data!$H150=\"\",\"\",Data!$H150)","v":""},null,null,null,null,null,null,null,null,{"$f":"IF(Data!$G181=\"\",\"\",Data!$G181)","v":""},null,null,null,null,{"$f":"IF(Data!$H181=\"\",\"\",Data!$H181)","v":""},null,null,null,null,null,null,null,null,{"$f":"IF(Data!$G212=\"\",\"\",Data!$G212)","v":""},null,null,null,null,{"$f":"IF(Data!$H212=\"\",\"\",Data!$H212)","v":""}]
[null,{"$f":"Data!$G27","v":510},null,null,null,null,{"$f":"Data!$H27","v":16.575796},null,null,null,null,null,null,null,null,{"$f":"Data!$G58","v":665},null,null,null,null,{"$f":"Data!$H58","v":15.698565},null,null,null,null,null,null,null,null,{"$f":"IF(Data!$G89=\"\",\"\",Data!$G89)","v":""},null,null,null,null,{"$f":"IF(Data!$H89=\"\",\"\",Data!$H89)","v":""},null,null,null,null,null,null,null,null,{"$f":"IF(Data!$G120=\"\",\"\",Data!$G120)","v":""},null,null,null,null,{"$f":"IF(Data!$H120=\"\",\"\",Data!$H120)","v":""},null,null,null,null,null,null,null,null,{"$f":"IF(Data!$G151=\"\",\"\",Data!$G151)","v":""},null,null,null,null,{"$f":"IF(Data!$H151=\"\",\"\",Data!$H151)","v":""},null,null,null,null,null,null,null,null,{"$f":"IF(Data!$G182=\"\",\"\",Data!$G182)","v":""},null,null,null,null,{"$f":"IF(Data!$H182=\"\",\"\",Data!$H182)","v":""},null,null,null,null,null,null,null,null,{"$f":"IF(Data!$G213=\"\",\"\",Data!$G213)","v":""},null,null,null,null,{"$f":"IF(Data!$H213=\"\",\"\",Data!$H213)","v":""}]
[null,{"$f":"Data!$G28","v":515},null,null,null,null,{"$f":"Data!$H28","v":16.400569999999998},null,null,null,null,null,null,null,null,{"$f":"Data!$G59","v":670},null,null,null,null,{"$f":"Data!$H59","v":15.748817000000001},null,null,null,null,null,null,null,null,{"$f":"IF(Data!$G90=\"\",\"\",Data!$G90)","v":""},null,null,null,null,{"$f":"IF(Data!$H90=\"\",\"\",Data!$H90)","v":""},null,null,null,null,null,null,null,null,{"$f":"IF(Data!$G121=\"\",\"\",Data!$G121)","v":""},null,null,null,null,{"$f":"IF(Data!$H121=\"\",\"\",Data!$H121)","v":""},null,null,null,null,null,null,null,null,{"$f":"IF(Data!$G152=\"\",\"\",Data!$G152)","v":""},null,null,null,null,{"$f":"IF(Data!$H152=\"\",\"\",Data!$H152)","v":""},null,null,null,null,null,null,null,null,{"$f":"IF(Data!$G183=\"\",\"\",Data!$G183)","v":""},null,null,null,null,{"$f":"IF(Data!$H183=\"\",\"\",Data!$H183)","v":""},null,null,null,null,null,null,null,null,{"$f":"IF(Data!$G214=\"\",\"\",Data!$G214)","v":""},null,null,null,null,{"$f":"IF(Data!$H214=\"\",\"\",Data!$H214)","v":""}]
[null,{"$f":"Data!$G29","v":520},null,null,null,null,{"$f":"Data!$H29","v":16.492079},null,null,null,null,null,null,null,null,{"$f":"Data!$G60","v":675},null,null,null,null,{"$f":"Data!$H60","v":15.637076},null,null,null,null,null,null,null,null,{"$f":"IF(Data!$G91=\"\",\"\",Data!$G91)","v":""},null,null,null,null,{"$f":"IF(Data!$H91=\"\",\"\",Data!$H91)","v":""},null,null,null,null,null,null,null,null,{"$f":"IF(Data!$G122=\"\",\"\",Data!$G122)","v":""},null,null,null,null,{"$f":"IF(Data!$H122=\"\",\"\",Data!$H122)","v":""},null,null,null,null,null,null,null,null,{"$f":"IF(Data!$G153=\"\",\"\",Data!$G153)","v":""},null,null,null,null,{"$f":"IF(Data!$H153=\"\",\"\",Data!$H153)","v":""},null,null,null,null,null,null,null,null,{"$f":"IF(Data!$G184=\"\",\"\",Data!$G184)","v":""},null,null,null,null,{"$f":"IF(Data!$H184=\"\",\"\",Data!$H184)","v":""},null,null,null,null,null,null,null,null,{"$f":"IF(Data!$G215=\"\",\"\",Data!$G215)","v":""},null,null,null,null,{"$f":"IF(Data!$H215=\"\",\"\",Data!$H215)","v":""}]
[null,{"$f":"Data!$G30","v":525},null,null,null,null,{"$f":"Data!$H30","v":16.956896},null,null,null,null,null,null,null,null,{"$f":"Data!$G61","v":680},null,null,null,null,{"$f":"Data!$H61","v":15.248099},null,null,null,null,null,null,null,null,{"$f":"IF(Data!$G92=\"\",\"\",Data!$G92)","v":""},null,null,null,null,{"$f":"IF(Data!$H92=\"\",\"\",Data!$H92)","v":""},null,null,null,null,null,null,null,null,{"$f":"IF(Data!$G123=\"\",\"\",Data!$G123)","v":""},null,null,null,null,{"$f":"IF(Data!$H123=\"\",\"\",Data!$H123)","v":""},null,null,null,null,null,null,null,null,{"$f":"IF(Data!$G154=\"\",\"\",Data!$G154)","v":""},null,null,null,null,{"$f":"IF(Data!$H154=\"\",\"\",Data!$H154)","v":""},null,null,null,null,null,null,null,null,{"$f":"IF(Data!$G185=\"\",\"\",Data!$G185)","v":""},null,null,null,null,{"$f":"IF(Data!$H185=\"\",\"\",Data!$H185)","v":""},null,null,null,null,null,null,null,null,{"$f":"IF(Data!$G216=\"\",\"\",Data!$G216)","v":""},null,null,null,null,{"$f":"IF(Data!$H216=\"\",\"\",Data!$H216)","v":""}]
[null,{"$f":"Data!$G31","v":530},null,null,null,null,{"$f":"Data!$H31","v":17.308287},null,null,null,null,null,null,null,null,{"$f":"Data!$G62","v":685},null,null,null,null,{"$f":"Data!$H62","v":14.304793},null,null,null,null,null,null,null,null,{"$f":"IF(Data!$G93=\"\",\"\",Data!$G93)","v":""},null,null,null,null,{"$f":"IF(Data!$H93=\"\",\"\",Data!$H93)","v":""},null,null,null,null,null,null,null,null,{"$f":"IF(Data!$G124=\"\",\"\",Data!$G124)","v":""},null,null,null,null,{"$f":"IF(Data!$H124=\"\",\"\",Data!$H124)","v":""},null,null,null,null,null,null,null,null,{"$f":"IF(Data!$G155=\"\",\"\",Data!$G155)","v":""},null,null,null,null,{"$f":"IF(Data!$H155=\"\",\"\",Data!$H155)","v":""},null,null,null,null,null,null,null,null,{"$f":"IF(Data!$G186=\"\",\"\",Data!$G186)","v":""},null,null,null,null,{"$f":"IF(Data!$H186=\"\",\"\",Data!$H186)","v":""},null,null,null,null,null,null,null,null,{"$f":"IF(Data!$G217=\"\",\"\",Data!$G217)","v":""},null,null,null,null,{"$f":"IF(Data!$H217=\"\",\"\",Data!$H217)","v":""}]
[]
[]
[]
[]
[]
[]
[]
[]
[]
[]
[{"$f":"'Protocol 1 (5nm)'!A54:AA54","v":"Company"}]
[{"$f":"'Protocol 1 (5nm)'!A55:AA55","v":"Address"}]
[{"$f":"'Protocol 1 (5nm)'!A56:AA56","v":"ZIP  City"}]
[]
[{"$f":"'Protocol 1 (5nm)'!A58:O58","v":"Test location,"},null,null,null,null,null,null,null,null,null,null,null,null,null,null,{"$f":"'Protocol 1 (5nm)'!P58:AA58","v":"Date"},null,null,null,null,null,null,null,null,null,null,null,null,null,null,null,null,null,null,null,null,null,null,null,null,null,null,null,null,null,null,null,null,null,null,null,null,null,null,null,null,null,null,null,null,null,null,null,{"$f":"'Protocol 1 (5nm)'!BL58:CF58","v":"First, last name of inspector"},null,null,null,null,null,null,null,null,null,null,null,null,null,null,null,null,null,null,null,null,{"$f":"'Protocol 1 (5nm)'!CG58:CX58","v":"Phone number"}]

{"sheet":"Protocol 3","index":2,"n_rows":64,"n_cols":85,"rows_kept":64,"cut":false,"hidden":false,"merged":[[60,0,60,26],[61,0,61,26],[63,0,63,14],[63,15,63,26],[0,0,1,53],[3,0,3,12],[3,13,3,58],[4,13,4,58],[5,13,5,58],[59,0,59,26],[63,63,63,83],[3,84,3,99],[4,62,4,83],[4,84,4,99],[5,84,5,99],[63,84,63,101],[5,62,5,83],[3,62,3,83]]}
[{"$f":"IF(Data!$AE$2=\"DE\",\"Messprotokoll\",IF(Data!$AE$2=\"UK\",\"Measurement protocol\",IF(Data!$AE$2=\"FR\",\"Rapport de mesure\",\"Language Error\")))","v":"Measurement protocol"}]
[]
[]
[{"$f":"IF(Data!$AE$2 = \"DE\", \"Prüfling:\", IF(Data!$AE$2 = \"UK\",\"Test object:\",IF(Data!$AE$2=\"FR\",\"Objet testé:\",\"Language Error\")))","v":"Test object:"},null,null,null,null,null,null,null,null,null,null,null,null,{"$f":"'Protocol 1 (5nm)'!N4:BG4","v":"Manufacturer"},null,null,null,null,null,null,null,null,null,null,null,null,null,null,null,null,null,null,null,null,null,null,null,null,null,null,null,null,null,null,null,null,null,null,null,null,null,null,null,null,null,null,null,null,null,null,null,null,{"$f":"IF(Data!$AE$2=\"DE\",\"Messdatei:\",IF(Data!$AE$2=\"UK\",\"Measurement file:\",IF(Data!$AE$2=\"FR\",\"Fichier de mesure:\",\"Language Error\")))","v":"Measurement file:"},null,null,null,null,null,null,null,null,null,null,null,null,null,null,null,null,null,null,null,null,null,{"$f":"Data!Q18","v":"Measured"}]
[null,null,null,null,null,null,null,null,null,null,null,null,null,{"$f":"'Protocol 1 (5nm)'!N5:BG5","v":"Type"},null,null,null,null,null,null,null,null,null,null,null,null,null,null,null,null,null,null,null,null,null,null,null,null,null,null,null,null,null,null,null,null,null,null,null,null,null,null,null,null,null,null,null,null,null,null,null,null,{"$f":"IF(Data!$AE$2=\"DE\",\"Datum der Messung:\",IF(Data!$AE$2=\"UK\",\"Date of measurement:\",IF(Data!$AE$2=\"FR\",\"Date de mesure:\",\"Language Error\")))","v":"Date of measurement:"},null,null,null,null,null,null,null,null,null,null,null,null,null,null,null,null,null,null,null,null,null,{"$f":"Data!Q23","v":"29.09.2021"}]
[null,null,null,null,null,null,null,null,null,null,null,null,null,{"$f":"'Protocol 1 (5nm)'!N6:BG6","v":"Model"},null,null,null,null,null,null,null,null,null,null,null,null,null,null,null,null,null,null,null,null,null,null,null,null,null,null,null,null,null,null,null,null,null,null,null,null,null,null,null,null,null,null,null,null,null,null,null,null,{"$f":"IF(Data!$AE$2=\"DE\",\"Uhrzeit der Messung:\",IF(Data!$AE$2=\"UK\",\"Time of measurement:\",IF(Data!$AE$2=\"FR\",\"Heure de mesure:\",\"Language Error\")))","v":"Time of measurement:"},null,null,null,null,null,null,null,null,null,null,null,null,null,null,null,null,null,null,null,null,null,{"$f":"Data!Q21","v":"10:06:00"}]
[]
[]
[]
[]
[]
[]
[]
[]
[]
[]
[]
[]
[]
[]
[]
[]
[]
[]
[]
[]
[]
[]
[]
[]
[]
[]
[]
[]
[]
[]
[]
[]
[]
[]
[]
[]
[]
[]
[]
[]
[]
[]
[]
[]
[]
[]
[]
[]
[]
[]
[]
[]
[]
[{"$f":"'Protocol 1 (5nm)'!A54:AA54","v":"Company"}]
[{"$f":"'Protocol 1 (5nm)'!A55:AA55","v":"Address"}]
[{"$f":"'Protocol 1 (5nm)'!A56:AA56","v":"ZIP  City"}]
[]
[{"$f":"'Protocol 1 (5nm)'!A58:O58","v":"Test location,"},null,null,null,null,null,null,null,null,null,null,null,null,null,null,{"$f":"'Protocol 1 (5nm)'!P58:AA58","v":"Date"},null,null,null,null,null,null,null,null,null,null,null,null,null,null,null,null,null,null,null,null,null,null,null,null,null,null,null,null,null,null,null,null,null,null,null,null,null,null,null,null,null,null,null,null,null,null,null,{"$f":"'Protocol 1 (5nm)'!BL58:CF58","v":"First, last name of inspector"},null,null,null,null,null,null,null,null,null,null,null,null,null,null,null,null,null,null,null,null,{"$f":"'Protocol 1 (5nm)'!CG58:CX58","v":"Phone number"}]

{"sheet":"Reference Comparison","index":3,"n_rows":55,"n_cols":92,"rows_kept":55,"cut":false,"hidden":false,"merged":[[54,84,54,101],[50,0,50,26],[51,0,51,26],[52,0,52,26],[54,0,54,14],[54,15,54,26],[54,63,54,83],[43,1,43,5],[43,6,43,15],[43,16,43,28],[43,29,43,34],[42,1,42,5],[42,6,42,15],[42,16,42,28],[42,29,42,34],[40,1,40,5],[40,6,40,15],[40,16,40,28],[40,29,40,34],[39,1,39,5],[39,6,39,15],[39,16,39,28],[39,29,39,34],[38,1,38,5],[38,6,38,15],[38,16,38,28],[38,29,38,34],[36,1,36,5],[36,6,36,15],[36,16,36,28],[36,29,36,34],[37,1,37,5],[37,6,37,15],[37,16,37,28],[37,29,37,34],[35,1,35,5],[35,6,35,15],[35,16,35,28],[35,29,35,34],[34,1,34,5],[34,6,34,15],[34,16,34,28],[34,29,34,34],[33,1,33,5],[33,6,33,15],[33,16,33,28],[33,29,33,34],[31,1,31,5],[31,6,31,15],[31,16,31,28],[31,29,31,34],[32,1,32,5],[32,6,32,15],[32,16,32,28],[32,29,32,34],[27,78,27,90],[27,91,27,101],[30,1,30,5],[30,6,30,15],[30,16,30,28],[30,29,30,34],[28,36,28,65],[28,66,28,77],[28,78,28,90],[28,91,28,101],[29,1,29,5],[29,6,29,15],[29,16,29,28],[29,29,29,34],[27,36,27,65],[27,66,27,77],[28,1,28,5],[28,6,28,15],[28,16,28,28],[28,29,28,34],[27,1,27,5],[27,6,27,15],[27,16,27,28],[27,29,27,34],[25,78,25,90],[25,91,25,101],[26,1,26,5],[26,6,26,15],[26,16,26,28],[26,29,26,34],[25,1,25,5],[25,6,25,15],[25,16,25,28],[25,29,25,34],[25,36,25,65],[25,66,25,77],[8,62,8,83],[8,84,8,99],[24,1,24,5],[24,6,24,15],[24,16,24,28],[24,29,24,34],[24,36,24,65],[24,66,24,77],[24,78,24,90],[24,91,24,101],[5,13,5,58],[5,62,5,83],[5,84,5,99],[6,62,6,83],[6,84,6,99],[7,62,7,83],[7,84,7,99],[0,0,1,53],[3,0,3,12],[3,13,3,58],[3,62,3,83],[3,84,3,99],[4,13,4,58],[4,62,4,83],[4,84,4,99]]}
[{"$f":"IF(Data!$AE$2=\"DE\",\"Messprotokoll\",IF(Data!$AE$2=\"UK\",\"Measurement protocol\",IF(Data!$AE$2=\"FR\",\"Rapport de mesure\",\"Language Error\")))","v":"Measurement protocol"}]
[]
[]
[{"$f":"IF(Data!$AE$2 = \"DE\", \"Prüfling:\", IF(Data!$AE$2 = \"UK\",\"Test object:\",IF(Data!$AE$2=\"FR\",\"Objet testé:\",\"Language Error\")))","v":"Test object:"},null,null,null,null,null,null,null,null,null,null,null,null,{"$f":"'Protocol 1 (5nm)'!N4:BG4","v":"Manufacturer"},null,null,null,null,null,null,null,null,null,null,null,null,null,null,null,null,null,null,null,null,null,null,null,null,null,null,null,null,null,null,null,null,null,null,null,null,null,null,null,null,null,null,null,null,null,null,null,null,{"$f":"IF(Data!$AE$2=\"DE\",\"Messdatei:\",IF(Data!$AE$2=\"UK\",\"Measurement file:\",IF(Data!$AE$2=\"FR\",\"Fichier de mesure:\",\"Language Error\")))","v":"Measurement file:"},null,null,null,null,null,null,null,null,null,null,null,null,null,null,null,null,null,null,null,null,null,{"$f":"Data!Q18","v":"Measured"}]
[null,null,null,null,null,null,null,null,null,null,null,null,null,{"$f":"'Protocol 1 (5nm)'!N5:BG5","v":"Type"},null,null,null,null,null,null,null,null,null,null,null,null,null,null,null,null,null,null,null,null,null,null,null,null,null,null,null,null,null,null,null,null,null,null,null,null,null,null,null,null,null,null,null,null,null,null,null,null,{"$f":"IF(Data!$AE$2=\"DE\",\"Datum der Messung:\",IF(Data!$AE$2=\"UK\",\"Date of measurement:\",IF(Data!$AE$2=\"FR\",\"Date de mesure:\",\"Language Error\")))","v":"Date of measurement:"},null,null,null,null,null,null,null,null,null,null,null,null,null,null,null,null,null,null,null,null,null,{"$f":"Data!Q23","v":"29.09.2021"}]
[null,null,null,null,null,null,null,null,null,null,null,null,null,{"$f":"'Protocol 1 (5nm)'!N6:BG6","v":"Model"},null,null,null,null,null,null,null,null,null,null,null,null,null,null,null,null,null,null,null,null,null,null,null,null,null,null,null,null,null,null,null,null,null,null,null,null,null,null,null,null,null,null,null,null,null,null,null,null,{"$f":"IF(Data!$AE$2=\"DE\",\"Uhrzeit der Messung:\",IF(Data!$AE$2=\"UK\",\"Time of measurement:\",IF(Data!$AE$2=\"FR\",\"Heure de mesure:\",\"Language Error\")))","v":"Time of measurement:"},null,null,null,null,null,null,null,null,null,null,null,null,null,null,null,null,null,null,null,null,null,{"$f":"Data!Q21","v":"10:06:00"}]
[null,null,null,null,null,null,null,null,null,null,null,null,null,null,null,null,null,null,null,null,null,null,null,null,null,null,null,null,null,null,null,null,null,null,null,null,null,null,null,null,null,null,null,null,null,null,null,null,null,null,null,null,null,null,null,null,null,null,null,null,null,null,{"$f":"IF(Data!$AE$2=\"DE\",\"Referenzdatei:\",IF(Data!$AE$2=\"UK\",\"Reference file:\",IF(Data!$AE$2=\"FR\",\"Fichier de référence:\",\"Language Error\")))","v":"Reference file:"},null,null,null,null,null,null,null,null,null,null,null,null,null,null,null,null,null,null,null,null,null,{"$f":"Data!AC18","v":"M_000001.CSV"}]
[null,null,null,null,null,null,null,null,null,null,null,null,null,null,null,null,null,null,null,null,null,null,null,null,null,null,null,null,null,null,null,null,null,null,null,null,null,null,null,null,null,null,null,null,null,null,null,null,null,null,null,null,null,null,null,null,null,null,null,null,null,null,{"$f":"IF(Data!$AE$2=\"DE\",\"Datum der Messung:\",IF(Data!$AE$2=\"UK\",\"Date of measurement:\",IF(Data!$AE$2=\"FR\",\"Date de mesure:\",\"Language Error\")))","v":"Date of measurement:"},null,null,null,null,null,null,null,null,null,null,null,null,null,null,null,null,null,null,null,null,null,{"$f":"Data!AC23","v":"29.09.2021"}]
[null,null,null,null,null,null,null,null,null,null,null,null,null,null,null,null,null,null,null,null,null,null,null,null,null,null,null,null,null,null,null,null,null,null,null,null,null,null,null,null,null,null,null,null,null,null,null,null,null,null,null,null,null,null,null,null,null,null,null,null,null,null,{"$f":"IF(Data!$AE$2=\"DE\",\"Uhrzeit der Messung:\",IF(Data!$AE$2=\"UK\",\"Time of measurement:\",IF(Data!$AE$2=\"FR\",\"Heure de mesure:\",\"Language Error\")))","v":"Time of measurement:"},null,null,null,null,null,null,null,null,null,null,null,null,null,null,null,null,null,null,null,null,null,{"$f":"Data!AC21","v":"00:10:04"}]
[]
[]
[]
[]
[]
[]
[]
[]
[]
[]
[]
[]
[]
[]
[]
[null,null,null,null,null,null,{"$f":"Data!$AB$18","v":"reference"},null,null,null,null,null,null,null,null,null,{"$f":"Data!$P$18","v":"measurement"},null,null,null,null,null,null,null,null,null,null,null,null,"Δ",null,null,null,null,null,null,null,null,null,null,null,null,null,null,null,null,null,null,null,null,null,null,null,null,null,null,null,null,null,null,null,null,null,null,null,null,{"$f":"Data!$AB$18","v":"reference"},null,null,null,null,null,null,null,null,null,null,null,{"$f":"Data!$P$18","v":"measurement"},null,null,null,null,null,null,null,null,null,null,null,null,"Δ"]
[null,"Ra",null,null,null,null,{"$f":"Data!W1","v":91.61},null,null,null,null,null,null,null,null,null,{"$f":"Data!K1","v":96.81},null,null,null,null,null,null,null,null,null,null,null,null,{"$f":"Q26-G26","v":5.2000000000000028},null,null,null,null,null,null,{"$f":"IF(Data!$AE$2=\"DE\",\"Beleuchtungsstärke\",IF(Data!$AE$2=\"UK\",\"Illuminance\",IF(Data!$AE$2=\"FR\",\"Illuminance\",\"Language Error\")))","v":"Illuminance"},null,null,null,null,null,null,null,null,null,null,null,null,null,null,null,null,null,null,null,null,null,null,null,null,null,null,null,null,null,{"$f":"Data!W33","v":1721.2},null,null,null,null,null,null,null,null,null,null,null,{"$f":"Data!K33","v":1214.58},null,null,null,null,null,null,null,null,null,null,null,null,{"$f":"CA26-BO26","v":-506.62000000000012}]
[null,"R1",null,null,null,null,{"$f":"Data!W2","v":94.51},null,null,null,null,null,null,null,null,null,{"$f":"Data!K2","v":96.04},null,null,null,null,null,null,null,null,null,null,null,null,{"$f":"Q27-G27","v":1.5300000000000011}]
[null,"R2",null,null,null,null,{"$f":"Data!W3","v":94.73},null,null,null,null,null,null,null,null,null,{"$f":"Data!K3","v":97.94},null,null,null,null,null,null,null,null,null,null,null,null,3.2099999999999937,null,null,null,null,null,null,{"$f":"IF(Data!$AE$2 = \"DE\", \"Ähnlichste Farbtemperatur (CCT)\", IF(Data!$AE$2 = \"UK\",\"correlated color temperature (CCT)\",IF(Data!$AE$2=\"FR\",\"temp. de couleur proximale (CCT)\",\"Language Error\")))","v":"correlated color temperature (CCT)"},null,null,null,null,null,null,null,null,null,null,null,null,null,null,null,null,null,null,null,null,null,null,null,null,null,null,null,null,null,{"$f":"Data!W30","v":4362},null,null,null,null,null,null,null,null,null,null,null,{"$f":"Data!K30","v":5040},null,null,null,null,null,null,null,null,null,null,null,null,{"$f":"CA28-BO28","v":678}]
[null,"R3",null,null,null,null,{"$f":"Data!W4","v":85.47},null,null,null,null,null,null,null,null,null,{"$f":"Data!K4","v":98.67},null,null,null,null,null,null,null,null,null,null,null,null,13.200000000000003,null,null,null,null,null,null,"Duv",null,null,null,null,null,null,null,null,null,null,null,null,null,null,null,null,null,null,null,null,null,null,null,null,null,null,null,null,null,{"$f":"Data!W31","v":6.4999999999999997E-3},null,null,null,null,null,null,null,null,null,null,null,{"$f":"Data!K31","v":7.1999999999999998E-3},null,null,null,null,null,null,null,null,null,null,null,null,{"$f":"CA29-BO29","v":7.000000000000001E-4}]
[null,"R4",null,null,null,null,{"$f":"Data!W5","v":93.08},null,null,null,null,null,null,null,null,null,{"$f":"Data!K5","v":95.47},null,null,null,null,null,null,null,null,null,null,null,null,2.3900000000000006]
[null,"R5",null,null,null,null,{"$f":"Data!W6","v":90.81},null,null,null,null,null,null,null,null,null,{"$f":"Data!K6","v":96.13},null,null,null,null,null,null,null,null,null,null,null,null,5.3199999999999932]
[null,"R6",null,null,null,null,{"$f":"Data!W7","v":89.59},null,null,null,null,null,null,null,null,null,{"$f":"Data!K7","v":97.65},null,null,null,null,null,null,null,null,null,null,null,null,8.0600000000000023]
[null,"R7",null,null,null,null,{"$f":"Data!W8","v":97.68},null,null,null,null,null,null,null,null,null,{"$f":"Data!K8","v":97.96},null,null,null,null,null,null,null,null,null,null,null,null,0.27999999999998693]
[null,"R8",null,null,null,null,{"$f":"Data!W9","v":86.97},null,null,null,null,null,null,null,null,null,{"$f":"Data!K9","v":94.59},null,null,null,null,null,null,null,null,null,null,null,null,7.6200000000000045]
[null,"R9",null,null,null,null,{"$f":"Data!W10","v":57.31},null,null,null,null,null,null,null,null,null,{"$f":"Data!K10","v":85.98},null,null,null,null,null,null,null,null,null,null,null,null,28.67]
[null,"R10",null,null,null,null,{"$f":"Data!W11","v":77.650000000000006},null,null,null,null,null,null,null,null,null,{"$f":"Data!K11","v":96.26},null,null,null,null,null,null,null,null,null,null,null,null,18.61]
[null,"R11",null,null,null,null,{"$f":"Data!W12","v":85.7},null,null,null,null,null,null,null,null,null,{"$f":"Data!K12","v":94.96},null,null,null,null,null,null,null,null,null,null,null,null,9.2599999999999909]
[null,"R12",null,null,null,null,{"$f":"Data!W13","v":77.63},null,null,null,null,null,null,null,null,null,{"$f":"Data!K13","v":95.33},null,null,null,null,null,null,null,null,null,null,null,null,17.700000000000003]
[null,"R13",null,null,null,null,{"$f":"Data!W14","v":94.65},null,null,null,null,null,null,null,null,null,{"$f":"Data!K14","v":96.38},null,null,null,null,null,null,null,null,null,null,null,null,1.7299999999999898]
[null,"R14",null,null,null,null,{"$f":"Data!W15","v":90.44},null,null,null,null,null,null,null,null,null,{"$f":"Data!K15","v":98.98},null,null,null,null,null,null,null,null,null,null,null,null,8.5400000000000063]
[null,"R15",null,null,null,null,{"$f":"Data!W16","v":92.98},null,null,null,null,null,null,null,null,null,{"$f":"Data!K16","v":94.47},null,null,null,null,null,null,null,null,null,null,null,null,1.4899999999999949]
[]
[null,"Re",null,null,null,null,{"$f":"Data!AC27","v":87.28},null,null,null,null,null,null,null,null,null,{"$f":"Data!Q27","v":95.79},null,null,null,null,null,null,null,null,null,null,null,null,{"$f":"Q43-G43","v":8.5100000000000051}]
[null,"GAI",null,null,null,null,{"$f":"Data!AC28","v":76.290000000000006},null,null,null,null,null,null,null,null,null,{"$f":"Data!Q28","v":83.56},null,null,null,null,null,null,null,null,null,null,null,null,{"$f":"Q44-G44","v":7.269999999999996}]
[]
[]
[]
[]
[]
[]
[{"$f":"'Protocol 1 (5nm)'!A54:AA54","v":"Company"}]
[{"$f":"'Protocol 1 (5nm)'!A55:AA55","v":"Address"}]
[{"$f":"'Protocol 1 (5nm)'!A56:AA56","v":"ZIP  City"}]
[]
[{"$f":"'Protocol 1 (5nm)'!A58:O58","v":"Test location,"},null,null,null,null,null,null,null,null,null,null,null,null,null,null,{"$f":"'Protocol 1 (5nm)'!P58:AA58","v":"Date"},null,null,null,null,null,null,null,null,null,null,null,null,null,null,null,null,null,null,null,null,null,null,null,null,null,null,null,null,null,null,null,null,null,null,null,null,null,null,null,null,null,null,null,null,null,null,null,{"$f":"'Protocol 1 (5nm)'!BL58:CF58","v":"First, last name of inspector"},null,null,null,null,null,null,null,null,null,null,null,null,null,null,null,null,null,null,null,null,{"$f":"'Protocol 1 (5nm)'!CG58:CX58","v":"Phone number"}]

{"sheet":"Data","index":4,"n_rows":285,"n_cols":40,"rows_kept":285,"cut":false,"hidden":false,"merged":[]}
["Seriennummer","21C10666","Serialnumber","21C10666",null,1,{"$f":"IF(INDEX($A$1:$A$500,MATCH(\"Spe*\",$A$1:$A$500,0)+F1)=0,\"\",INDEX($A$1:$A$500,MATCH(\"Spe*\",$A$1:$A$500,0)+F1))","v":380},{"$f":"IF(INDEX($A$1:$A$500,MATCH(\"Spe*\",$A$1:$A$500,0)+F1)=0,\"\",INDEX($B$1:$B$500,MATCH(\"Spe*\",$A$1:$A$500,0)+F1))","v":1.7470250000000001},"CRI","Ra",{"$f":"IF(ISNA(MATCH(I1,$A$1:$A$259,0)),IF($A$1=\"\",NA(),INDEX($B$1:$B$259,MATCH(J1,$A$1:$A$259,0))),IF($A$1=\"\",NA(),INDEX($B$1:$B$259,MATCH(I1,$A$1:$A$259,0))))","v":96.81},{"$f":"IF(K1=\"\",NA(),IF(K1 < 0, 0, K1))","v":96.81},{"$f":"IF(G1=\"\",NA(),ROUND(G1,0))","v":380},{"$f":"IF(H1=\"\",NA(),H1)","v":1.7470250000000001},null,"R15",{"$f":"IF($A$1=\"\",NA(),INDEX($B$1:$B$259,MATCH(P1,$A$1:$A$259,0)))","v":94.47},1,{"$f":"IF(INDEX($C$1:$C$500,MATCH(\"Spe*\",$C$1:$C$500,0)+R1)=0,\"\",INDEX($C$1:$C$500,MATCH(\"Spe*\",$C$1:$C$500,0)+R1))","v":380},{"$f":"IF(INDEX($C$1:$C$500,MATCH(\"Spe*\",$C$1:$C$500,0)+R1)=0,\"\",INDEX($D$1:$D$500,MATCH(\"Spe*\",$C$1:$C$500,0)+R1))","v":1.4735100000000001},"CRI","Ra",{"$f":"IF(ISNA(MATCH(U1,$C$1:$C$259,0)),IF($C$1=\"\",NA(),INDEX($D$1:$D$259,MATCH(V1,$C$1:$C$259,0))),IF($C$1=\"\",NA(),INDEX($D$1:$D$259,MATCH(U1,$C$1:$C$259,0))))","v":91.61},null,{"$f":"IF(S1=\"\",NA(),ROUND(S1,0))","v":380},{"$f":"IF(T1=\"\",NA(),T1)","v":1.4735100000000001},null,"R15",{"$f":"IF($C$1=\"\",NA(),INDEX($D$1:$D$259,MATCH(AB1,$C$1:$C$259,0)))","v":92.98},null,null,null,"u","v","u'","v'","x","y",null,"Seriennummer"]
["Software Rev.","1.3.1","Software Rev.","1.3.1",null,{"$f":"F1+1","v":2},{"$f":"IF(INDEX($A$1:$A$500,MATCH(\"Spe*\",$A$1:$A$500,0)+F2)=0,\"\",INDEX($A$1:$A$500,MATCH(\"Spe*\",$A$1:$A$500,0)+F2))","v":385},{"$f":"IF(INDEX($A$1:$A$500,MATCH(\"Spe*\",$A$1:$A$500,0)+F2)=0,\"\",INDEX($B$1:$B$500,MATCH(\"Spe*\",$A$1:$A$500,0)+F2))","v":1.9551480000000001},null,"R1",{"$f":"IF($A$1=\"\",NA(),INDEX($B$1:$B$259,MATCH(J2,$A$1:$A$259,0)))","v":96.04},{"$f":"IF(K2=\"\",NA(),IF(K2 < 0, 0, K2))","v":96.04},385,{"$f":"IF(H2=\"\",NA(),H2)","v":1.9551480000000001},null,"R14",98.98,{"$f":"R1+1","v":2},{"$f":"IF(INDEX($C$1:$C$500,MATCH(\"Spe*\",$C$1:$C$500,0)+R2)=0,\"\",INDEX($C$1:$C$500,MATCH(\"Spe*\",$C$1:$C$500,0)+R2))","v":385},{"$f":"IF(INDEX($C$1:$C$500,MATCH(\"Spe*\",$C$1:$C$500,0)+R2)=0,\"\",INDEX($D$1:$D$500,MATCH(\"Spe*\",$C$1:$C$500,0)+R2))","v":1.6106400000000001},null,"R1",{"$f":"IF($C$1=\"\",NA(),INDEX($D$1:$D$259,MATCH(V2,$C$1:$C$259,0)))","v":94.51},null,385,{"$f":"IF(T2=\"\",NA(),T2)","v":1.6106400000000001},null,"R14",90.44,null,"UK",null,0.18006,0.26351999999999998,{"$f":"AG2","v":0.18006},{"$f":"AH2*1.5","v":0.39527999999999996},{"$f":"(9*AG2)/(6*AG2-16*AJ2+12)","v":0.23987104566688575},{"$f":"(4*AJ2)/(6*AG2-16*AJ2+12)","v":0.23403612852803776},null,"Software Rev."]
["Zeit","10:06:00","Time","00:10:04",null,{"$f":"F2+1","v":3},390,2.3422209999999999,null,"R2",97.94,97.94,390,2.3422209999999999,null,"R13",96.38,{"$f":"R2+1","v":3},390,1.9224699999999999,null,"R2",94.73,null,390,1.9224699999999999,null,"R13",94.65,null,null,null,0.18065999999999999,0.26589000000000002,{"$f":"AG3","v":0.18065999999999999},{"$f":"AH3*1.5","v":0.39883500000000005},{"$f":"(9*AG3)/(6*AG3-16*AJ3+12)","v":0.24258347506937611},{"$f":"(4*AJ3)/(6*AG3-16*AJ3+12)","v":0.23801808253513571},null,"Zeit"]
["Datum","29.09.2021","Date","29.09.2021",null,4,395,3.0443509999999998,null,"R3",98.67,98.67,395,3.0443509999999998,null,"R12",95.33,4,395,2.38205,null,"R3",85.47,null,395,2.38205,null,"R12",77.63,null,null,null,0.18132999999999999,0.26845999999999998,0.18132999999999999,0.40268999999999999,0.24559589702841558,0.24240399461846157,null,"Datum"]
[null,null,null,null,null,5,400,4.4780259999999998,null,"R4",95.47,95.47,400,4.4780259999999998,null,"R11",94.96,5,400,4.70174,null,"R4",93.08,null,400,4.70174,null,"R11",85.7,null,null,null,0.18207999999999999,0.27118999999999999,0.18207999999999999,0.40678499999999995,0.24889731345459842,0.24713848284912326]
["Integrationszeit [ms]",1298,"Integrationtime [ms]",498,null,6,405,5.9537769999999997,null,"R5",96.13,96.13,405,5.9537769999999997,null,"R10",96.26,6,405,7.8577599999999999,null,"R5",90.81,null,405,7.8577599999999999,null,"R10",77.650000000000006,null,null,null,0.18293000000000001,0.27406999999999998,0.18293000000000001,0.41110499999999994,0.25251460911977175,0.25221552477798731,null,"Integrationszeit [ms]"]
["E vis [lx]",1214.58,"E vis [lx]",1721.2,null,7,410,6.9295419999999996,null,"R6",97.65,97.65,410,6.9295419999999996,null,"R9",85.98,7,410,7.70817,null,"R6",89.59,null,410,7.70817,null,"R9",57.31,null,null,null,0.18387999999999999,0.27709,0.18387999999999999,0.41563499999999998,0.25645269265099674,0.25763351681047303,null,"E vis [lx]"]
["Ee [W/m²]",0,"CCT [K]",4362,null,8,415,8.1653699999999994,null,"R7",97.96,97.96,415,8.1653699999999994,null,"R8",94.59,8,415,7.5195299999999996,null,"R7",97.68,null,415,7.5195299999999996,null,"R8",86.97,null,null,null,0.18493999999999999,0.28021000000000001,0.18493999999999999,0.42031499999999999,0.26069918240766848,0.26333051404943147,null,"Ee [W/m²]"]
["LER [lm/W]",null,"Duv",6.4999999999999997E-3,null,9,420,8.8666110000000007,null,"R8",94.59,94.59,420,8.8666110000000007,null,"R7",97.96,9,420,8.4256899999999995,null,"R8",86.97,null,420,8.4256899999999995,null,"R7",97.68,null,null,null,0.18611,0.28342000000000001,0.18611,0.42513000000000001,0.26525754682021607,0.2693005710593579,null,"LER [lm/W]"]
["CCT [K]",5040,"Ra",91.61,null,10,425,9.1403680000000005,null,"R9",85.98,85.98,425,9.1403680000000005,null,"R6",97.65,10,425,9.1501400000000004,null,"R9",57.31,null,425,9.1501400000000004,null,"R6",89.59,null,null,null,0.18740000000000001,0.28667999999999999,0.18740000000000001,0.43001999999999996,0.27011184994426723,0.27547372871583958,null,"CCT [K]"]
["Duv",7.1999999999999998E-3,"Re",87.28,null,11,430,9.2625890000000002,null,"R10",96.26,96.26,430,9.2625890000000002,null,"R5",96.13,11,430,11.067600000000001,null,"R10",77.650000000000006,null,430,11.067600000000001,null,"R5",90.81,null,null,null,0.1888,0.28997000000000001,0.1888,0.43495499999999998,0.27524005753605724,0.28181977218831394,null,"Duv"]
[null,null,"GAI",76.290000000000006,null,12,435,10.222623,null,"R11",94.96,94.96,435,10.222623,null,"R4",95.47,12,435,19.214189999999999,null,"R11",85.7,null,435,19.214189999999999,null,"R4",93.08,null,null,null,0.19031999999999999,0.29326000000000002,0.19031999999999999,0.43989,0.28063070147845237,0.28827854671280279]
[null,null,"R1",94.51,null,13,440,11.434519999999999,null,"R12",95.33,95.33,440,11.434519999999999,null,"R3",98.67,13,440,18.466670000000001,null,"R12",77.63,null,440,18.466670000000001,null,"R3",85.47,null,null,null,0.19461999999999999,0.30141000000000001,0.19461999999999999,0.45211500000000004,0.29518291573135957,0.3047685494145484]
[null,null,"R2",94.73,null,14,445,12.582395999999999,null,"R13",96.38,96.38,445,12.582395999999999,null,"R2",97.94,14,445,13.97334,null,"R13",94.65,null,445,13.97334,null,"R2",94.73,null,null,null,0.19961999999999999,0.30920999999999998,0.19961999999999999,0.46381499999999998,0.3110056295311493,0.32116371341324079]
[null,null,"R3",85.47,null,15,450,13.676095,null,"R14",98.98,98.98,450,13.676095,null,"R1",96.04,15,450,14.68242,null,"R14",90.44,null,450,14.68242,null,"R1",94.51,null,null,null,0.20524999999999999,0.31646999999999997,0.20524999999999999,0.47470499999999993,0.32774625546909086,0.33689600476915366]
[null,null,"R4",93.08,null,16,455,14.475695,null,"R15",94.47,94.47,455,14.475695,"CRI","Ra",{"$f":"IF(ISNA(MATCH(O16,$A$1:$A$259,0)),IF($A$1=\"\",NA(),INDEX($B$1:$B$259,MATCH(P16,$A$1:$A$259,0))),IF($A$1=\"\",NA(),INDEX($B$1:$B$259,MATCH(O16,$A$1:$A$259,0))))","v":96.81},16,455,15.24776,null,"R15",92.98,null,455,15.24776,"CRI","Ra",{"$f":"IF(ISNA(MATCH(AA16,$C$1:$C$259,0)),IF($C$1=\"\",NA(),INDEX($D$1:$D$259,MATCH(AB16,$C$1:$C$259,0))),IF($C$1=\"\",NA(),INDEX($D$1:$D$259,MATCH(AA16,$C$1:$C$259,0))))","v":91.61},null,null,null,0.21142,0.32312000000000002,0.21142,0.48468,0.34510414172851323,0.35162252160097501]
[null,null,"R5",90.81,null,17,460,14.90868,null,"Integrationtime [ms]",null,null,460,14.90868,null,null,null,17,460,15.54082,null,"Integrationtime [ms]",null,null,460,15.54082,null,null,null,null,null,null,0.21807000000000001,0.32908999999999999,0.21807000000000001,0.49363499999999999,0.36276075456632401,0.36496212751328033]
[null,null,"R6",89.59,null,18,465,15.160750999999999,null,"Integrationszeit [ms]",{"$f":"IF(ISNA(MATCH(J17,$A$1:$A$259,0)),IF($A$1=\"\",NA(),INDEX($B$1:$B$259,MATCH(J18,$A$1:$A$259,0))),IF($A$1=\"\",NA(),INDEX($B$1:$B$259,MATCH(J17,$A$1:$A$259,0))))","v":1298},null,465,15.160750999999999,null,"measurement","Measured",18,465,15.60059,null,"Integrationszeit [ms]",{"$f":"IF(ISNA(MATCH(V17,$C$1:$C$259,0)),IF($C$1=\"\",NA(),INDEX($D$1:$D$259,MATCH(V18,$C$1:$C$259,0))),IF($C$1=\"\",NA(),INDEX($D$1:$D$259,MATCH(V17,$C$1:$C$259,0))))","v":498},null,465,15.60059,null,"reference","M_000001.CSV",null,null,null,0.22511,0.33439000000000002,0.22511,0.50158500000000006,0.38044617204664538,0.37675623908512212]
[null,null,"R7",97.68,null,19,470,15.360201,null,null,null,null,470,15.360201,null,null,null,19,470,15.51365,null,null,null,null,470,15.51365,null,null,null,null,null,null,0.23247000000000001,0.33904000000000001,0.23247000000000001,0.50856000000000001,0.39792425055060426,0.38689504855587636]
[null,null,"R8",86.97,null,20,475,15.666918000000001,null,null,null,null,475,15.666918000000001,null,"Time",null,20,475,15.90448,null,null,null,null,475,15.90448,null,"Time",null,null,null,null,0.24010000000000001,0.34308,0.24010000000000001,0.51461999999999997,0.41502454539168915,0.39535366106616876]
[null,null,"R9",57.31,null,21,480,15.932422000000001,null,null,null,null,480,15.932422000000001,null,"Zeit",{"$f":"IF(ISNA(MATCH(P20,$A$1:$A$259,0)),IF($A$1=\"\",NA(),INDEX($B$1:$B$259,MATCH(P21,$A$1:$A$259,0))),IF($A$1=\"\",NA(),INDEX($B$1:$B$259,MATCH(P20,$A$1:$A$259,0))))","v":"10:06:00"},21,480,17.212219999999999,null,null,null,null,480,17.212219999999999,null,"Zeit",{"$f":"IF(ISNA(MATCH(AB20,$C$1:$C$259,0)),IF($C$1=\"\",NA(),INDEX($D$1:$D$259,MATCH(AB21,$C$1:$C$259,0))),IF($C$1=\"\",NA(),INDEX($D$1:$D$259,MATCH(AB20,$C$1:$C$259,0))))","v":"00:10:04"},null,null,null,0.24701999999999999,0.34655000000000002,0.24701999999999999,0.51982499999999998,0.43043841918171039,0.40258125972909548]
[null,null,"R10",77.650000000000006,null,22,485,15.754631,null,null,null,null,485,15.754631,null,"Date",null,22,485,20.175149999999999,null,null,null,null,485,20.175149999999999,null,"Date",null,null,null,null,0.25591000000000003,0.34950999999999999,0.25591000000000003,0.52426499999999998,0.44746290230454494,0.40741604205765436]
[null,null,"R11",85.7,null,23,490,15.870525000000001,null,"x",{"$f":"IF($A$1=\"\",NA(),INDEX($B$1:$B$259,MATCH(J23,$A$1:$A$259,0)))","v":0.3453},null,490,15.870525000000001,null,"Datum",{"$f":"IF(ISNA(MATCH(P22,$A$1:$A$259,0)),IF($A$1=\"\",NA(),INDEX($B$1:$B$259,MATCH(P23,$A$1:$A$259,0))),IF($A$1=\"\",NA(),INDEX($B$1:$B$259,MATCH(P22,$A$1:$A$259,0))))","v":"29.09.2021"},23,490,21.48396,null,"x",{"$f":"IF($C$1=\"\",NA(),INDEX($D$1:$D$259,MATCH(V23,$C$1:$C$259,0)))","v":0.36899999999999999},null,490,21.48396,null,"Datum",{"$f":"IF(ISNA(MATCH(AB22,$C$1:$C$259,0)),IF($C$1=\"\",NA(),INDEX($D$1:$D$259,MATCH(AB23,$C$1:$C$259,0))),IF($C$1=\"\",NA(),INDEX($D$1:$D$259,MATCH(AB22,$C$1:$C$259,0))))","v":"29.09.2021"},null,null,null,0.26400000000000001,0.35199999999999998,0.26400000000000001,0.52800000000000002,0.46261682242990665,0.41121495327102814]
[null,null,"R12",77.63,null,24,495,16.288945999999999,null,"y",0.36630000000000001,null,495,16.288945999999999,null,null,null,24,495,19.656759999999998,null,"y",0.38319999999999999,null,495,19.656759999999998,null,null,null,null,null,null,0.27217999999999998,0.35407,0.27217999999999998,0.53110499999999994,0.47700665965650185,0.4136815048486972]
[null,null,"R13",94.65,null,25,500,16.311502000000001,null,"u'",0.20599999999999999,null,500,16.311502000000001,null,null,null,25,500,17.592700000000001,null,"u'",0.2152,null,500,17.592700000000001,null,null,null,null,null,null,0.28038999999999997,0.35576999999999998,0.28038999999999997,0.53365499999999999,0.49058683556706439,0.41498407810476956]
[null,null,"R14",90.44,null,26,505,16.393141,null,"v'",0.49170000000000003,null,505,16.393141,null,null,null,26,505,16.1431,null,"v'",0.50270000000000004,null,505,16.1431,null,null,null,null,null,null,0.28863,0.35714000000000001,0.28863,0.53571000000000002,0.503383445533503,0.41524527073377748]
[null,null,"R15",92.98,null,27,510,16.575796,null,"u",0.20599999999999999,null,510,16.575796,null,"Re",{"$f":"IF($A$1=\"\",NA(),INDEX($B$1:$B$259,MATCH(P27,$A$1:$A$259,0)))","v":95.79},27,510,15.70593,null,"u",0.2152,null,510,15.70593,null,"Re",{"$f":"IF($C$1=\"\",NA(),INDEX($D$1:$D$259,MATCH(AB27,$C$1:$C$259,0)))","v":87.28},null,null,null,0.29685,0.35822999999999999,0.29685,0.53734499999999996,0.51540634079149927,0.41465165001794119]
[null,null,"x",0.36899999999999999,null,28,515,16.400569999999998,null,"v",0.32779999999999998,null,515,16.400569999999998,null,"GAI",{"$f":"IF(ISNA(MATCH(O28,$A$1:$A$259,0)),IF($A$1=\"\",NA(),INDEX($B$1:$B$259,MATCH(P28,$A$1:$A$259,0))),IF($A$1=\"\",NA(),INDEX($B$1:$B$259,MATCH(O28,$A$1:$A$259,0))))","v":83.56},28,515,15.453049999999999,null,"v",0.33510000000000001,null,515,15.453049999999999,null,"GAI",{"$f":"IF(ISNA(MATCH(AA28,$C$1:$C$259,0)),IF($C$1=\"\",NA(),INDEX($D$1:$D$259,MATCH(AB28,$C$1:$C$259,0))),IF($C$1=\"\",NA(),INDEX($D$1:$D$259,MATCH(AA28,$C$1:$C$259,0))))","v":76.290000000000006},null,null,null,0.30504999999999999,0.35907,0.30504999999999999,0.538605,0.52669291066680479,0.41330847059636044]
[null,null,"y",0.38319999999999999,null,29,520,16.492079,null,null,null,null,520,16.492079,null,null,null,29,520,15.553710000000001,null,null,null,null,520,15.553710000000001,null,null,null,null,null,null,0.31319999999999998,0.35968,0.31319999999999998,0.53952,0.53723355594181688,0.41130729119019305]
[null,null,"u'",0.2152,null,30,525,16.956896,null,"CCT [K]",{"$f":"IF($A$1=\"\",NA(),INDEX($B$1:$B$259,MATCH(J30,$A$1:$A$259,0)))","v":5040},null,525,16.956896,null,null,null,30,525,16.21996,null,"CCT [K]",{"$f":"IF($C$1=\"\",NA(),INDEX($D$1:$D$259,MATCH(V30,$C$1:$C$259,0)))","v":4362},null,525,16.21996,null,null,null,null,null,null,0.32129000000000002,0.36010999999999999,0.32129000000000002,0.54016500000000001,0.54712493614122726,0.40882102514616564]
[null,null,"v'",0.50270000000000004,null,31,530,17.308287,null,"Duv",{"$f":"IF($A$1=\"\",NA(),INDEX($B$1:$B$259,MATCH(J31,$A$1:$A$259,0)))","v":7.1999999999999998E-3},null,530,17.308287,null,null,null,31,530,17.947299999999998,null,"Duv",{"$f":"IF($C$1=\"\",NA(),INDEX($D$1:$D$259,MATCH(V31,$C$1:$C$259,0)))","v":6.4999999999999997E-3},null,530,17.947299999999998,null,null,null,null,null,null,0.32930999999999999,0.36037999999999998,0.32930999999999999,0.54056999999999999,0.55639847261176623,0.4059293301343786]
[null,null,"u",0.2152,null,32,535,17.530825,null,"E vis [fc]",null,null,535,17.530825,null,null,null,32,535,23.317270000000001,null,"E vis [fc]",null,null,535,23.317270000000001,null,null,null,null,null,null,0.33723999999999998,0.36051,0.33723999999999998,0.54076499999999994,0.56508042895442345,0.40271447721179615]
[null,null,"v",0.33510000000000001,null,33,540,17.427284,null,"E vis [lx]",{"$f":"IF(ISNA(MATCH(J32,$A$1:$A$259,0)),IF($A$1=\"\",NA(),INDEX($B$1:$B$259,MATCH(J33,$A$1:$A$259,0))),IF($A$1=\"\",NA(),INDEX($B$1:$B$259,MATCH(J32,$A$1:$A$259,0))))","v":1214.58},null,540,17.427284,null,null,null,33,540,37.234209999999997,null,"E vis [lx]",{"$f":"IF(ISNA(MATCH(V32,$C$1:$C$259,0)),IF($C$1=\"\",NA(),INDEX($D$1:$D$259,MATCH(V33,$C$1:$C$259,0))),IF($C$1=\"\",NA(),INDEX($D$1:$D$259,MATCH(V32,$C$1:$C$259,0))))","v":1721.2},null,540,37.234209999999997,null,null,null,null,null,null,0.37,0.35980000000000001,{"$f":"AG33","v":0.37},{"$f":"AH33*1.5","v":0.53970000000000007},{"$f":"(9*AG33)/(6*AG33-16*AJ33+12)","v":0.59626128061882266},{"$f":"(4*AJ33)/(6*AG33-16*AJ33+12)","v":0.38654920498495932}]
[null,null,null,null,null,34,545,17.464561,null,null,null,null,545,17.464561,null,null,null,34,545,47.176110000000001,null,null,null,null,545,47.176110000000001,null,null,null,null,null,null,0.4,0.35699999999999998,{"$f":"AG34","v":0.4},{"$f":"AH34*1.5","v":0.53549999999999998},{"$f":"(9*AG34)/(6*AG34-16*AJ34+12)","v":0.61728395061728392},{"$f":"(4*AJ34)/(6*AG34-16*AJ34+12)","v":0.36728395061728386}]
[null,null,"Resolution","5 nm",null,35,550,17.491382999999999,null,null,null,null,550,17.491382999999999,null,null,null,35,550,37.412489999999998,null,null,null,null,550,37.412489999999998]
[null,null,"Spectrum in [nm]","mW/m²/nm",null,36,555,17.440124999999998,null,null,null,null,555,17.440124999999998,null,null,null,36,555,23.903980000000001,null,null,null,null,555,23.903980000000001]
[null,null,380,1.4735100000000001,null,37,560,17.214663000000002,null,null,null,null,560,17.214663000000002,null,null,null,37,560,18.830020000000001,null,null,null,null,560,18.830020000000001]
[null,null,385,1.6106400000000001,null,38,565,16.857655000000001,null,null,null,null,565,16.857655000000001,null,null,null,38,565,17.49051,null,null,null,null,565,17.49051]
[null,null,390,1.9224699999999999,null,39,570,16.620396,null,null,null,null,570,16.620396,null,null,null,39,570,17.499230000000001,null,null,null,null,570,17.499230000000001]
[null,null,395,2.38205,null,40,575,16.517523000000001,null,null,null,null,575,16.517523000000001,null,null,null,40,575,19.342790000000001,null,null,null,null,575,19.342790000000001]
[null,null,400,4.70174,null,41,580,16.530363000000001,null,null,null,null,580,16.530363000000001,null,null,null,41,580,22.483599999999999,null,null,null,null,580,22.483599999999999]
[null,null,405,7.8577599999999999,null,42,585,16.294405000000001,null,null,null,null,585,16.294405000000001,null,null,null,42,585,24.074190000000002,null,null,null,null,585,24.074190000000002]
[null,null,410,7.70817,null,43,590,15.751006,null,null,null,null,590,15.751006,null,null,null,43,590,23.138110000000001,null,null,null,null,590,23.138110000000001]
[null,null,415,7.5195299999999996,null,44,595,15.803174,null,null,null,null,595,15.803174,null,null,null,44,595,21.577020000000001,null,null,null,null,595,21.577020000000001]
[null,null,420,8.4256899999999995,null,45,600,16.115704000000001,null,null,null,null,600,16.115704000000001,null,null,null,45,600,21.337479999999999,null,null,null,null,600,21.337479999999999]
[null,null,425,9.1501400000000004,null,46,605,16.306222999999999,null,null,null,null,605,16.306222999999999,null,null,null,46,605,26.703900000000001,null,null,null,null,605,26.703900000000001]
[null,null,430,11.067600000000001,null,47,610,16.259893000000002,null,null,null,null,610,16.259893000000002,null,null,null,47,610,39.13823,null,null,null,null,610,39.13823]
[null,null,435,19.214189999999999,null,48,615,16.116161000000002,null,null,null,null,615,16.116161000000002,null,null,null,48,615,37.869790000000002,null,null,null,null,615,37.869790000000002]
[null,null,440,18.466670000000001,null,49,620,16.033514,null,null,null,null,620,16.033514,null,null,null,49,620,26.87499,null,null,null,null,620,26.87499]
[null,null,445,13.97334,null,50,625,15.820515,null,null,null,null,625,15.820515,null,null,null,50,625,23.070540000000001,null,null,null,null,625,23.070540000000001]
[null,null,450,14.68242,null,51,630,15.616255000000001,null,null,null,null,630,15.616255000000001,null,null,null,51,630,21.274139999999999,null,null,null,null,630,21.274139999999999]
[null,null,455,15.24776,null,52,635,15.801816000000001,null,null,null,null,635,15.801816000000001,null,null,null,52,635,18.596889999999998,null,null,null,null,635,18.596889999999998]
[null,null,460,15.54082,null,53,640,15.819179999999999,null,null,null,null,640,15.819179999999999,null,null,null,53,640,16.76801,null,null,null,null,640,16.76801]
[null,null,465,15.60059,null,54,645,15.523285,null,null,null,null,645,15.523285,null,null,null,54,645,16.212520000000001,null,null,null,null,645,16.212520000000001]
[null,null,470,15.51365,null,55,650,15.154457000000001,null,null,null,null,650,15.154457000000001,null,null,null,55,650,16.104520000000001,null,null,null,null,650,16.104520000000001]
[null,null,475,15.90448,null,56,655,15.060684999999999,null,null,null,null,655,15.060684999999999,null,null,null,56,655,15.831390000000001,null,null,null,null,655,15.831390000000001]
[null,null,480,17.212219999999999,null,57,660,15.393768,null,null,null,null,660,15.393768,null,null,null,57,660,15.910690000000001,null,null,null,null,660,15.910690000000001]
[null,null,485,20.175149999999999,null,58,665,15.698565,null,null,null,null,665,15.698565,null,null,null,58,665,16.007439999999999,null,null,null,null,665,16.007439999999999]
[null,null,490,21.48396,null,59,670,15.748817000000001,null,null,null,null,670,15.748817000000001,null,null,null,59,670,15.87359,null,null,null,null,670,15.87359]
[null,null,495,19.656759999999998,null,60,675,15.637076,null,null,null,null,675,15.637076,null,null,null,60,675,15.727209999999999,null,null,null,null,675,15.727209999999999]
[null,null,500,17.592700000000001,null,61,680,15.248099,null,null,null,null,680,15.248099,null,null,null,61,680,15.30932,null,null,null,null,680,15.30932]
[null,null,505,16.1431,null,62,685,14.304793,null,null,null,null,685,14.304793,null,null,null,62,685,14.61806,null,null,null,null,685,14.61806]
[null,null,510,15.70593,null,63,690,13.662929999999999,null,null,null,null,690,13.662929999999999,null,null,null,63,690,14.10763,null,null,null,null,690,14.10763]
[null,null,515,15.453049999999999,null,64,695,14.074071,null,null,null,null,695,14.074071,null,null,null,64,695,14.379709999999999,null,null,null,null,695,14.379709999999999]
[null,null,520,15.553710000000001,null,65,700,14.629459000000001,null,null,null,null,700,14.629459000000001,null,null,null,65,700,15.368880000000001,null,null,null,null,700,15.368880000000001]
[null,null,525,16.21996,null,66,{"$f":"IF(INDEX($A$1:$A$500,MATCH(\"Spe*\",$A$1:$A$500,0)+F66)=0,\"\",INDEX($A$1:$A$500,MATCH(\"Spe*\",$A$1:$A$500,0)+F66))","v":705},{"$f":"IF(INDEX($A$1:$A$500,MATCH(\"Spe*\",$A$1:$A$500,0)+F66)=0,\"\",INDEX($B$1:$B$500,MATCH(\"Spe*\",$A$1:$A$500,0)+F66))","v":15.202375},null,null,null,null,{"$f":"IF(G66=\"\",NA(),ROUND(G66,0))","v":705},{"$f":"IF(H66=\"\",NA(),H66)","v":15.202375},null,null,null,66,{"$f":"IF(INDEX($C$1:$C$500,MATCH(\"Spe*\",$C$1:$C$500,0)+R66)=0,\"\",INDEX($C$1:$C$500,MATCH(\"Spe*\",$C$1:$C$500,0)+R66))","v":705},{"$f":"IF(INDEX($C$1:$C$500,MATCH(\"Spe*\",$C$1:$C$500,0)+R66)=0,\"\",INDEX($D$1:$D$500,MATCH(\"Spe*\",$C$1:$C$500,0)+R66))","v":17.443470000000001},null,null,null,null,{"$f":"IF(S66=\"\",NA(),ROUND(S66,0))","v":705},{"$f":"IF(T66=\"\",NA(),T66)","v":17.443470000000001}]
[null,null,530,17.947299999999998,null,{"$f":"F66+1","v":67},710,15.358993999999999,null,null,null,null,710,15.358993999999999,null,null,null,{"$f":"R66+1","v":67},710,18.222259999999999,null,null,null,null,710,18.222259999999999]
[null,null,535,23.317270000000001,null,68,715,14.246861000000001,null,null,null,null,715,14.246861000000001,null,null,null,68,715,16.074770000000001,null,null,null,null,715,16.074770000000001]
[null,null,540,37.234209999999997,null,69,720,13.123232,null,null,null,null,720,13.123232,null,null,null,69,720,14.04514,null,null,null,null,720,14.04514]
[null,null,545,47.176110000000001,null,70,725,13.262581000000001,null,null,null,null,725,13.262581000000001,null,null,null,70,725,14.044140000000001,null,null,null,null,725,14.044140000000001]
[null,null,550,37.412489999999998,null,71,730,14.46374,null,null,null,null,730,14.46374,null,null,null,71,730,15.381819999999999,null,null,null,null,730,15.381819999999999]
[null,null,555,23.903980000000001,null,72,735,16.200191,null,null,null,null,735,16.200191,null,null,null,72,735,17.495280000000001,null,null,null,null,735,17.495280000000001]
[null,null,560,18.830020000000001,null,73,740,17.517562999999999,null,null,null,null,740,17.517562999999999,null,null,null,73,740,19.041029999999999,null,null,null,null,740,19.041029999999999]
[null,null,565,17.49051,null,74,745,18.14922,null,null,null,null,745,18.14922,null,null,null,74,745,19.70627,null,null,null,null,745,19.70627]
[null,null,570,17.499230000000001,null,75,750,18.020264000000001,null,null,null,null,750,18.020264000000001,null,null,null,75,750,19.742940000000001,null,null,null,null,750,19.742940000000001]
[null,null,575,19.342790000000001,null,76,755,15.876512999999999,null,null,null,null,755,15.876512999999999,null,null,null,76,755,17.53004,null,null,null,null,755,17.53004]
[null,null,580,22.483599999999999,null,77,760,12.366732000000001,null,null,null,null,760,12.366732000000001,null,null,null,77,760,13.8043,null,null,null,null,760,13.8043]
[null,null,585,24.074190000000002,null,78,765,12.548769999999999,null,null,null,null,765,12.548769999999999,null,null,null,78,765,13.91686,null,null,null,null,765,13.91686]
[null,null,590,23.138110000000001,null,79,770,15.813597,null,null,null,null,770,15.813597,null,null,null,79,770,17.6021,null,null,null,null,770,17.6021]
[null,null,595,21.577020000000001,null,80,775,17.428082,null,null,null,null,775,17.428082,null,null,null,80,775,19.484449999999999,null,null,null,null,775,19.484449999999999]
[null,null,600,21.337479999999999,null,81,780,17.473745000000001,null,null,null,null,780,17.473745000000001,null,null,null,81,780,19.247959999999999,null,null,null,null,780,19.247959999999999]
[null,null,605,26.703900000000001,null,82,"","",null,null,null,null,{"$error":"#N/A"},{"$error":"#N/A"},null,null,null,82,"","",null,null,null,null,{"$error":"#N/A"},{"$error":"#N/A"}]
[null,null,610,39.13823,null,83,"","",null,null,null,null,{"$error":"#N/A"},{"$error":"#N/A"},null,null,null,83,"","",null,null,null,null,{"$f":"IF(S83=\"\",NA(),ROUND(S83,0))","v":{"$error":"#N/A"}},{"$f":"IF(T83=\"\",NA(),T83)","v":{"$error":"#N/A"}}]
[null,null,615,37.869790000000002,null,84,"","",null,null,null,null,{"$error":"#N/A"},{"$error":"#N/A"},null,null,null,84,"","",null,null,null,null,{"$error":"#N/A"},{"$error":"#N/A"}]
[null,null,620,26.87499,null,85,"","",null,null,null,null,{"$error":"#N/A"},{"$error":"#N/A"},null,null,null,85,"","",null,null,null,null,{"$error":"#N/A"},{"$error":"#N/A"}]
[null,null,625,23.070540000000001,null,86,"","",null,null,null,null,{"$error":"#N/A"},{"$error":"#N/A"},null,null,null,86,"","",null,null,null,null,{"$error":"#N/A"},{"$error":"#N/A"}]
[null,null,630,21.274139999999999,null,87,"","",null,null,null,null,{"$error":"#N/A"},{"$error":"#N/A"},null,null,null,87,"","",null,null,null,null,{"$error":"#N/A"},{"$error":"#N/A"}]
[null,null,635,18.596889999999998,null,88,"","",null,null,null,null,{"$error":"#N/A"},{"$error":"#N/A"},null,null,null,88,"","",null,null,null,null,{"$error":"#N/A"},{"$error":"#N/A"}]
[null,null,640,16.76801,null,89,"","",null,null,null,null,{"$error":"#N/A"},{"$error":"#N/A"},null,null,null,89,"","",null,null,null,null,{"$error":"#N/A"},{"$error":"#N/A"}]
[null,null,645,16.212520000000001,null,90,"","",null,null,null,null,{"$error":"#N/A"},{"$error":"#N/A"},null,null,null,90,"","",null,null,null,null,{"$error":"#N/A"},{"$error":"#N/A"}]
[null,null,650,16.104520000000001,null,91,"","",null,null,null,null,{"$error":"#N/A"},{"$error":"#N/A"},null,null,null,91,"","",null,null,null,null,{"$error":"#N/A"},{"$error":"#N/A"}]
[null,null,655,15.831390000000001,null,92,"","",null,null,null,null,{"$error":"#N/A"},{"$error":"#N/A"},null,null,null,92,"","",null,null,null,null,{"$error":"#N/A"},{"$error":"#N/A"}]
[null,null,660,15.910690000000001,null,93,"","",null,null,null,null,{"$error":"#N/A"},{"$error":"#N/A"},null,null,null,93,"","",null,null,null,null,{"$error":"#N/A"},{"$error":"#N/A"}]
[null,null,665,16.007439999999999,null,94,"","",null,null,null,null,{"$error":"#N/A"},{"$error":"#N/A"},null,null,null,94,"","",null,null,null,null,{"$error":"#N/A"},{"$error":"#N/A"}]
[null,null,670,15.87359,null,95,"","",null,null,null,null,{"$error":"#N/A"},{"$error":"#N/A"},null,null,null,95,"","",null,null,null,null,{"$error":"#N/A"},{"$error":"#N/A"}]
[null,null,675,15.727209999999999,null,96,"","",null,null,null,null,{"$error":"#N/A"},{"$error":"#N/A"},null,null,null,96,"","",null,null,null,null,{"$error":"#N/A"},{"$error":"#N/A"}]
[null,null,680,15.30932,null,97,"","",null,null,null,null,{"$error":"#N/A"},{"$error":"#N/A"},null,null,null,97,"","",null,null,null,null,{"$error":"#N/A"},{"$error":"#N/A"}]
[null,null,685,14.61806,null,98,"","",null,null,null,null,{"$error":"#N/A"},{"$error":"#N/A"},null,null,null,98,"","",null,null,null,null,{"$f":"IF(S98=\"\",NA(),ROUND(S98,0))","v":{"$error":"#N/A"}},{"$f":"IF(T98=\"\",NA(),T98)","v":{"$error":"#N/A"}}]
[null,null,690,14.10763,null,99,"","",null,null,null,null,{"$error":"#N/A"},{"$error":"#N/A"},null,null,null,99,"","",null,null,null,null,{"$error":"#N/A"},{"$error":"#N/A"}]
[null,null,695,14.379709999999999,null,100,"","",null,null,null,null,{"$error":"#N/A"},{"$error":"#N/A"},null,null,null,100,"","",null,null,null,null,{"$error":"#N/A"},{"$error":"#N/A"}]
[null,null,700,15.368880000000001,null,101,"","",null,null,null,null,{"$error":"#N/A"},{"$error":"#N/A"},null,null,null,101,"","",null,null,null,null,{"$error":"#N/A"},{"$error":"#N/A"}]
[null,null,705,17.443470000000001,null,102,"","",null,null,null,null,{"$error":"#N/A"},{"$error":"#N/A"},null,null,null,102,"","",null,null,null,null,{"$error":"#N/A"},{"$error":"#N/A"}]
[null,null,710,18.222259999999999,null,103,"","",null,null,null,null,{"$error":"#N/A"},{"$error":"#N/A"},null,null,null,103,"","",null,null,null,null,{"$error":"#N/A"},{"$error":"#N/A"}]
[null,null,715,16.074770000000001,null,104,"","",null,null,null,null,{"$error":"#N/A"},{"$error":"#N/A"},null,null,null,104,"","",null,null,null,null,{"$error":"#N/A"},{"$error":"#N/A"}]
[null,null,720,14.04514,null,105,"","",null,null,null,null,{"$error":"#N/A"},{"$error":"#N/A"},null,null,null,105,"","",null,null,null,null,{"$error":"#N/A"},{"$error":"#N/A"}]
[null,null,725,14.044140000000001,null,106,"","",null,null,null,null,{"$error":"#N/A"},{"$error":"#N/A"},null,null,null,106,"","",null,null,null,null,{"$error":"#N/A"},{"$error":"#N/A"}]
[null,null,730,15.381819999999999,null,107,"","",null,null,null,null,{"$error":"#N/A"},{"$error":"#N/A"},null,null,null,107,"","",null,null,null,null,{"$error":"#N/A"},{"$error":"#N/A"}]
[null,null,735,17.495280000000001,null,108,"","",null,null,null,null,{"$error":"#N/A"},{"$error":"#N/A"},null,null,null,108,"","",null,null,null,null,{"$error":"#N/A"},{"$error":"#N/A"}]
[null,null,740,19.041029999999999,null,109,"","",null,null,null,null,{"$error":"#N/A"},{"$error":"#N/A"},null,null,null,109,"","",null,null,null,null,{"$error":"#N/A"},{"$error":"#N/A"}]
[null,null,745,19.70627,null,110,"","",null,null,null,null,{"$error":"#N/A"},{"$error":"#N/A"},null,null,null,110,"","",null,null,null,null,{"$error":"#N/A"},{"$error":"#N/A"}]
[null,null,750,19.742940000000001,null,111,"","",null,null,null,null,{"$error":"#N/A"},{"$error":"#N/A"},null,null,null,111,"","",null,null,null,null,{"$error":"#N/A"},{"$error":"#N/A"}]
[null,null,755,17.53004,null,112,"","",null,null,null,null,{"$error":"#N/A"},{"$error":"#N/A"},null,null,null,112,"","",null,null,null,null,{"$error":"#N/A"},{"$error":"#N/A"}]
["Ra",96.81,760,13.8043,null,113,"","",null,null,null,null,{"$error":"#N/A"},{"$error":"#N/A"},null,null,null,113,"","",null,null,null,null,{"$error":"#N/A"},{"$error":"#N/A"},null,null,null,null,null,null,null,null,null,null,null,null,null,"Ra"]
["Re",95.79,765,13.91686,null,114,"","",null,null,null,null,{"$error":"#N/A"},{"$error":"#N/A"},null,null,null,114,"","",null,null,null,null,{"$error":"#N/A"},{"$error":"#N/A"},null,null,null,null,null,null,null,null,null,null,null,null,null,"Re"]
["GAI",83.56,770,17.6021,null,115,"","",null,null,null,null,{"$error":"#N/A"},{"$error":"#N/A"},null,null,null,115,"","",null,null,null,null,{"$error":"#N/A"},{"$error":"#N/A"},null,null,null,null,null,null,null,null,null,null,null,null,null,"GAI"]
["R1",96.04,775,19.484449999999999,null,116,"","",null,null,null,null,{"$error":"#N/A"},{"$error":"#N/A"},null,null,null,116,"","",null,null,null,null,{"$error":"#N/A"},{"$error":"#N/A"},null,null,null,null,null,null,null,null,null,null,null,null,null,"R1"]
["R2",97.94,780,19.247959999999999,null,117,"","",null,null,null,null,{"$error":"#N/A"},{"$error":"#N/A"},null,null,null,117,"","",null,null,null,null,{"$error":"#N/A"},{"$error":"#N/A"},null,null,null,null,null,null,null,null,null,null,null,null,null,"R2"]
["R3",98.67,null,null,null,118,"","",null,null,null,null,{"$error":"#N/A"},{"$error":"#N/A"},null,null,null,118,"","",null,null,null,null,{"$error":"#N/A"},{"$error":"#N/A"},null,null,null,null,null,null,null,null,null,null,null,null,null,"R3"]
["R4",95.47,null,null,null,119,"","",null,null,null,null,{"$error":"#N/A"},{"$error":"#N/A"},null,null,null,119,"","",null,null,null,null,{"$error":"#N/A"},{"$error":"#N/A"},null,null,null,null,null,null,null,null,null,null,null,null,null,"R4"]
["R5",96.13,null,null,null,120,"","",null,null,null,null,{"$error":"#N/A"},{"$error":"#N/A"},null,null,null,120,"","",null,null,null,null,{"$error":"#N/A"},{"$error":"#N/A"},null,null,null,null,null,null,null,null,null,null,null,null,null,"R5"]
["R6",97.65,null,null,null,121,"","",null,null,null,null,{"$error":"#N/A"},{"$error":"#N/A"},null,null,null,121,"","",null,null,null,null,{"$error":"#N/A"},{"$error":"#N/A"},null,null,null,null,null,null,null,null,null,null,null,null,null,"R6"]
["R7",97.96,null,null,null,122,"","",null,null,null,null,{"$error":"#N/A"},{"$error":"#N/A"},null,null,null,122,"","",null,null,null,null,{"$error":"#N/A"},{"$error":"#N/A"},null,null,null,null,null,null,null,null,null,null,null,null,null,"R7"]
["R8",94.59,null,null,null,123,"","",null,null,null,null,{"$error":"#N/A"},{"$error":"#N/A"},null,null,null,123,"","",null,null,null,null,{"$error":"#N/A"},{"$error":"#N/A"},null,null,null,null,null,null,null,null,null,null,null,null,null,"R8"]
["R9",85.98,null,null,null,124,"","",null,null,null,null,{"$error":"#N/A"},{"$error":"#N/A"},null,null,null,124,"","",null,null,null,null,{"$error":"#N/A"},{"$error":"#N/A"},null,null,null,null,null,null,null,null,null,null,null,null,null,"R9"]
["R10",96.26,null,null,null,125,"","",null,null,null,null,{"$error":"#N/A"},{"$error":"#N/A"},null,null,null,125,"","",null,null,null,null,{"$error":"#N/A"},{"$error":"#N/A"},null,null,null,null,null,null,null,null,null,null,null,null,null,"R10"]
["R11",94.96,null,null,null,126,"","",null,null,null,null,{"$error":"#N/A"},{"$error":"#N/A"},null,null,null,126,"","",null,null,null,null,{"$error":"#N/A"},{"$error":"#N/A"},null,null,null,null,null,null,null,null,null,null,null,null,null,"R11"]
["R12",95.33,null,null,null,127,"","",null,null,null,null,{"$error":"#N/A"},{"$error":"#N/A"},null,null,null,127,"","",null,null,null,null,{"$error":"#N/A"},{"$error":"#N/A"},null,null,null,null,null,null,null,null,null,null,null,null,null,"R12"]
["R13",96.38,null,null,null,128,"","",null,null,null,null,{"$error":"#N/A"},{"$error":"#N/A"},null,null,null,128,"","",null,null,null,null,{"$error":"#N/A"},{"$error":"#N/A"},null,null,null,null,null,null,null,null,null,null,null,null,null,"R13"]
["R14",98.98,null,null,null,129,"","",null,null,null,null,{"$error":"#N/A"},{"$error":"#N/A"},null,null,null,129,"","",null,null,null,null,{"$error":"#N/A"},{"$error":"#N/A"},null,null,null,null,null,null,null,null,null,null,null,null,null,"R14"]
["R15",94.47,null,null,null,130,{"$f":"IF(INDEX($A$1:$A$500,MATCH(\"Spe*\",$A$1:$A$500,0)+F130)=0,\"\",INDEX($A$1:$A$500,MATCH(\"Spe*\",$A$1:$A$500,0)+F130))","v":""},{"$f":"IF(INDEX($A$1:$A$500,MATCH(\"Spe*\",$A$1:$A$500,0)+F130)=0,\"\",INDEX($B$1:$B$500,MATCH(\"Spe*\",$A$1:$A$500,0)+F130))","v":""},null,null,null,null,{"$f":"IF(G130=\"\",NA(),ROUND(G130,0))","v":{"$error":"#N/A"}},{"$f":"IF(H130=\"\",NA(),H130)","v":{"$error":"#N/A"}},null,null,null,130,{"$f":"IF(INDEX($C$1:$C$500,MATCH(\"Spe*\",$C$1:$C$500,0)+R130)=0,\"\",INDEX($C$1:$C$500,MATCH(\"Spe*\",$C$1:$C$500,0)+R130))","v":""},{"$f":"IF(INDEX($C$1:$C$500,MATCH(\"Spe*\",$C$1:$C$500,0)+R130)=0,\"\",INDEX($D$1:$D$500,MATCH(\"Spe*\",$C$1:$C$500,0)+R130))","v":""},null,null,null,null,{"$error":"#N/A"},{"$error":"#N/A"},null,null,null,null,null,null,null,null,null,null,null,null,null,"R15"]
["x",0.3453,null,null,null,{"$f":"F130+1","v":131},"","",null,null,null,null,{"$error":"#N/A"},{"$error":"#N/A"},null,null,null,{"$f":"R130+1","v":131},"","",null,null,null,null,{"$error":"#N/A"},{"$error":"#N/A"},null,null,null,null,null,null,null,null,null,null,null,null,null,"x"]
["y",0.36630000000000001,null,null,null,132,"","",null,null,null,null,{"$error":"#N/A"},{"$error":"#N/A"},null,null,null,132,"","",null,null,null,null,{"$error":"#N/A"},{"$error":"#N/A"},null,null,null,null,null,null,null,null,null,null,null,null,null,"y"]
["u",0.20599999999999999,null,null,null,133,"","",null,null,null,null,{"$error":"#N/A"},{"$error":"#N/A"},null,null,null,133,"","",null,null,null,null,{"$error":"#N/A"},{"$error":"#N/A"},null,null,null,null,null,null,null,null,null,null,null,null,null,"u"]
["v",0.32779999999999998,null,null,null,134,"","",null,null,null,null,{"$error":"#N/A"},{"$error":"#N/A"},null,null,null,134,"","",null,null,null,null,{"$error":"#N/A"},{"$error":"#N/A"},null,null,null,null,null,null,null,null,null,null,null,null,null,"v"]
["u'",0.20599999999999999,null,null,null,135,"","",null,null,null,null,{"$error":"#N/A"},{"$error":"#N/A"},null,null,null,135,"","",null,null,null,null,{"$error":"#N/A"},{"$error":"#N/A"},null,null,null,null,null,null,null,null,null,null,null,null,null,"u'"]
["v'",0.49170000000000003,null,null,null,136,"","",null,null,null,null,{"$error":"#N/A"},{"$error":"#N/A"},null,null,null,136,"","",null,null,null,null,{"$error":"#N/A"},{"$error":"#N/A"},null,null,null,null,null,null,null,null,null,null,null,null,null,"v'"]
[null,null,null,null,null,137,"","",null,null,null,null,{"$error":"#N/A"},{"$error":"#N/A"},null,null,null,137,"","",null,null,null,null,{"$error":"#N/A"},{"$error":"#N/A"}]
[null,null,null,null,null,138,"","",null,null,null,null,{"$error":"#N/A"},{"$error":"#N/A"},null,null,null,138,"","",null,null,null,null,{"$error":"#N/A"},{"$error":"#N/A"}]
[null,null,null,null,null,139,"","",null,null,null,null,{"$error":"#N/A"},{"$error":"#N/A"},null,null,null,139,"","",null,null,null,null,{"$error":"#N/A"},{"$error":"#N/A"}]
[null,null,null,null,null,140,"","",null,null,null,null,{"$error":"#N/A"},{"$error":"#N/A"},null,null,null,140,"","",null,null,null,null,{"$error":"#N/A"},{"$error":"#N/A"}]
[null,null,null,null,null,141,"","",null,null,null,null,{"$error":"#N/A"},{"$error":"#N/A"},null,null,null,141,"","",null,null,null,null,{"$error":"#N/A"},{"$error":"#N/A"}]
[null,null,null,null,null,142,"","",null,null,null,null,{"$error":"#N/A"},{"$error":"#N/A"},null,null,null,142,"","",null,null,null,null,{"$error":"#N/A"},{"$error":"#N/A"}]
[null,null,null,null,null,143,"","",null,null,null,null,{"$error":"#N/A"},{"$error":"#N/A"},null,null,null,143,"","",null,null,null,null,{"$error":"#N/A"},{"$error":"#N/A"}]
[null,null,null,null,null,144,"","",null,null,null,null,{"$error":"#N/A"},{"$error":"#N/A"},null,null,null,144,"","",null,null,null,null,{"$error":"#N/A"},{"$error":"#N/A"}]
[null,null,null,null,null,145,"","",null,null,null,null,{"$error":"#N/A"},{"$error":"#N/A"},null,null,null,145,"","",null,null,null,null,{"$error":"#N/A"},{"$error":"#N/A"}]
[null,null,null,null,null,146,"","",null,null,null,null,{"$error":"#N/A"},{"$error":"#N/A"},null,null,null,146,"","",null,null,null,null,{"$error":"#N/A"},{"$error":"#N/A"}]
[null,null,null,null,null,147,"","",null,null,null,null,{"$error":"#N/A"},{"$error":"#N/A"},null,null,null,147,"","",null,null,null,null,{"$error":"#N/A"},{"$error":"#N/A"}]
[null,null,null,null,null,148,"","",null,null,null,null,{"$error":"#N/A"},{"$error":"#N/A"},null,null,null,148,"","",null,null,null,null,{"$error":"#N/A"},{"$error":"#N/A"}]
[null,null,null,null,null,149,"","",null,null,null,null,{"$error":"#N/A"},{"$error":"#N/A"},null,null,null,149,"","",null,null,null,null,{"$error":"#N/A"},{"$error":"#N/A"}]
[null,null,null,null,null,150,"","",null,null,null,null,{"$error":"#N/A"},{"$error":"#N/A"},null,null,null,150,"","",null,null,null,null,{"$error":"#N/A"},{"$error":"#N/A"}]
[null,null,null,null,null,151,"","",null,null,null,null,{"$error":"#N/A"},{"$error":"#N/A"},null,null,null,151,"","",null,null,null,null,{"$error":"#N/A"},{"$error":"#N/A"}]
[null,null,null,null,null,152,"","",null,null,null,null,{"$error":"#N/A"},{"$error":"#N/A"},null,null,null,152,"","",null,null,null,null,{"$error":"#N/A"},{"$error":"#N/A"}]
[null,null,null,null,null,153,"","",null,null,null,null,{"$error":"#N/A"},{"$error":"#N/A"},null,null,null,153,"","",null,null,null,null,{"$error":"#N/A"},{"$error":"#N/A"}]
[null,null,null,null,null,154,"","",null,null,null,null,{"$error":"#N/A"},{"$error":"#N/A"},null,null,null,154,"","",null,null,null,null,{"$error":"#N/A"},{"$error":"#N/A"}]
[null,null,null,null,null,155,"","",null,null,null,null,{"$error":"#N/A"},{"$error":"#N/A"},null,null,null,155,"","",null,null,null,null,{"$error":"#N/A"},{"$error":"#N/A"}]
[null,null,null,null,null,156,"","",null,null,null,null,{"$error":"#N/A"},{"$error":"#N/A"},null,null,null,156,"","",null,null,null,null,{"$error":"#N/A"},{"$error":"#N/A"}]
[null,null,null,null,null,157,"","",null,null,null,null,{"$error":"#N/A"},{"$error":"#N/A"},null,null,null,157,"","",null,null,null,null,{"$error":"#N/A"},{"$error":"#N/A"}]
[null,null,null,null,null,158,"","",null,null,null,null,{"$error":"#N/A"},{"$error":"#N/A"},null,null,null,158,"","",null,null,null,null,{"$error":"#N/A"},{"$error":"#N/A"}]
[null,null,null,null,null,159,"","",null,null,null,null,{"$error":"#N/A"},{"$error":"#N/A"},null,null,null,159,"","",null,null,null,null,{"$error":"#N/A"},{"$error":"#N/A"}]
[null,null,null,null,null,160,"","",null,null,null,null,{"$error":"#N/A"},{"$error":"#N/A"},null,null,null,160,"","",null,null,null,null,{"$error":"#N/A"},{"$error":"#N/A"}]
[null,null,null,null,null,161,"","",null,null,null,null,{"$error":"#N/A"},{"$error":"#N/A"},null,null,null,161,"","",null,null,null,null,{"$error":"#N/A"},{"$error":"#N/A"}]
[null,null,null,null,null,162,"","",null,null,null,null,{"$error":"#N/A"},{"$error":"#N/A"},null,null,null,162,"","",null,null,null,null,{"$f":"IF(S162=\"\",NA(),ROUND(S162,0))","v":{"$error":"#N/A"}},{"$f":"IF(T162=\"\",NA(),T162)","v":{"$error":"#N/A"}}]
[null,null,null,null,null,163,"","",null,null,null,null,{"$error":"#N/A"},{"$error":"#N/A"},null,null,null,163,"","",null,null,null,null,{"$error":"#N/A"},{"$error":"#N/A"}]
[null,null,null,null,null,164,"","",null,null,null,null,{"$error":"#N/A"},{"$error":"#N/A"},null,null,null,164,"","",null,null,null,null,{"$error":"#N/A"},{"$error":"#N/A"}]
[null,null,null,null,null,165,"","",null,null,null,null,{"$error":"#N/A"},{"$error":"#N/A"},null,null,null,165,"","",null,null,null,null,{"$error":"#N/A"},{"$error":"#N/A"}]
[null,null,null,null,null,166,"","",null,null,null,null,{"$error":"#N/A"},{"$error":"#N/A"},null,null,null,166,"","",null,null,null,null,{"$error":"#N/A"},{"$error":"#N/A"}]
[null,null,null,null,null,167,"","",null,null,null,null,{"$error":"#N/A"},{"$error":"#N/A"},null,null,null,167,"","",null,null,null,null,{"$error":"#N/A"},{"$error":"#N/A"}]
[null,null,null,null,null,168,"","",null,null,null,null,{"$error":"#N/A"},{"$error":"#N/A"},null,null,null,168,"","",null,null,null,null,{"$error":"#N/A"},{"$error":"#N/A"}]
[null,null,null,null,null,169,"","",null,null,null,null,{"$error":"#N/A"},{"$error":"#N/A"},null,null,null,169,"","",null,null,null,null,{"$error":"#N/A"},{"$error":"#N/A"}]
[null,null,null,null,null,170,"","",null,null,null,null,{"$error":"#N/A"},{"$error":"#N/A"},null,null,null,170,"","",null,null,null,null,{"$error":"#N/A"},{"$error":"#N/A"}]
[null,null,null,null,null,171,"","",null,null,null,null,{"$error":"#N/A"},{"$error":"#N/A"},null,null,null,171,"","",null,null,null,null,{"$error":"#N/A"},{"$error":"#N/A"}]
[null,null,null,null,null,172,"","",null,null,null,null,{"$error":"#N/A"},{"$error":"#N/A"},null,null,null,172,"","",null,null,null,null,{"$error":"#N/A"},{"$error":"#N/A"}]
[null,null,null,null,null,173,"","",null,null,null,null,{"$error":"#N/A"},{"$error":"#N/A"},null,null,null,173,"","",null,null,null,null,{"$error":"#N/A"},{"$error":"#N/A"}]
[null,null,null,null,null,174,"","",null,null,null,null,{"$error":"#N/A"},{"$error":"#N/A"},null,null,null,174,"","",null,null,null,null,{"$error":"#N/A"},{"$error":"#N/A"}]
[null,null,null,null,null,175,"","",null,null,null,null,{"$error":"#N/A"},{"$error":"#N/A"},null,null,null,175,"","",null,null,null,null,{"$error":"#N/A"},{"$error":"#N/A"}]
[null,null,null,null,null,176,"","",null,null,null,null,{"$error":"#N/A"},{"$error":"#N/A"},null,null,null,176,"","",null,null,null,null,{"$error":"#N/A"},{"$error":"#N/A"}]
[null,null,null,null,null,177,"","",null,null,null,null,{"$error":"#N/A"},{"$error":"#N/A"},null,null,null,177,"","",null,null,null,null,{"$error":"#N/A"},{"$error":"#N/A"}]
[null,null,null,null,null,178,"","",null,null,null,null,{"$error":"#N/A"},{"$error":"#N/A"},null,null,null,178,"","",null,null,null,null,{"$error":"#N/A"},{"$error":"#N/A"}]
[null,null,null,null,null,179,"","",null,null,null,null,{"$error":"#N/A"},{"$error":"#N/A"},null,null,null,179,"","",null,null,null,null,{"$error":"#N/A"},{"$error":"#N/A"}]
[null,null,null,null,null,180,"","",null,null,null,null,{"$error":"#N/A"},{"$error":"#N/A"},null,null,null,180,"","",null,null,null,null,{"$error":"#N/A"},{"$error":"#N/A"}]
[null,null,null,null,null,181,"","",null,null,null,null,{"$error":"#N/A"},{"$error":"#N/A"},null,null,null,181,"","",null,null,null,null,{"$error":"#N/A"},{"$error":"#N/A"}]
[null,null,null,null,null,182,"","",null,null,null,null,{"$error":"#N/A"},{"$error":"#N/A"},null,null,null,182,"","",null,null,null,null,{"$error":"#N/A"},{"$error":"#N/A"}]
[null,null,null,null,null,183,"","",null,null,null,null,{"$error":"#N/A"},{"$error":"#N/A"},null,null,null,183,"","",null,null,null,null,{"$error":"#N/A"},{"$error":"#N/A"}]
[null,null,null,null,null,184,"","",null,null,null,null,{"$error":"#N/A"},{"$error":"#N/A"},null,null,null,184,"","",null,null,null,null,{"$error":"#N/A"},{"$error":"#N/A"}]
[null,null,null,null,null,185,"","",null,null,null,null,{"$error":"#N/A"},{"$error":"#N/A"},null,null,null,185,"","",null,null,null,null,{"$error":"#N/A"},{"$error":"#N/A"}]
[null,null,null,null,null,186,"","",null,null,null,null,{"$error":"#N/A"},{"$error":"#N/A"},null,null,null,186,"","",null,null,null,null,{"$error":"#N/A"},{"$error":"#N/A"}]
[null,null,null,null,null,187,"","",null,null,null,null,{"$error":"#N/A"},{"$error":"#N/A"},null,null,null,187,"","",null,null,null,null,{"$error":"#N/A"},{"$error":"#N/A"}]
[null,null,null,null,null,188,"","",null,null,null,null,{"$error":"#N/A"},{"$error":"#N/A"},null,null,null,188,"","",null,null,null,null,{"$error":"#N/A"},{"$error":"#N/A"}]
[null,null,null,null,null,189,"","",null,null,null,null,{"$error":"#N/A"},{"$error":"#N/A"},null,null,null,189,"","",null,null,null,null,{"$error":"#N/A"},{"$error":"#N/A"}]
[null,null,null,null,null,190,"","",null,null,null,null,{"$error":"#N/A"},{"$error":"#N/A"},null,null,null,190,"","",null,null,null,null,{"$error":"#N/A"},{"$error":"#N/A"}]
[null,null,null,null,null,191,"","",null,null,null,null,{"$error":"#N/A"},{"$error":"#N/A"},null,null,null,191,"","",null,null,null,null,{"$error":"#N/A"},{"$error":"#N/A"}]
[null,null,null,null,null,192,"","",null,null,null,null,{"$error":"#N/A"},{"$error":"#N/A"},null,null,null,192,"","",null,null,null,null,{"$error":"#N/A"},{"$error":"#N/A"}]
[null,null,null,null,null,193,"","",null,null,null,null,{"$error":"#N/A"},{"$error":"#N/A"},null,null,null,193,"","",null,null,null,null,{"$error":"#N/A"},{"$error":"#N/A"}]
[null,null,null,null,null,194,{"$f":"IF(INDEX($A$1:$A$500,MATCH(\"Spe*\",$A$1:$A$500,0)+F194)=0,\"\",INDEX($A$1:$A$500,MATCH(\"Spe*\",$A$1:$A$500,0)+F194))","v":""},{"$f":"IF(INDEX($A$1:$A$500,MATCH(\"Spe*\",$A$1:$A$500,0)+F194)=0,\"\",INDEX($B$1:$B$500,MATCH(\"Spe*\",$A$1:$A$500,0)+F194))","v":""},null,null,null,null,{"$f":"IF(G194=\"\",NA(),ROUND(G194,0))","v":{"$error":"#N/A"}},{"$f":"IF(H194=\"\",NA(),H194)","v":{"$error":"#N/A"}},null,null,null,194,{"$f":"IF(INDEX($C$1:$C$500,MATCH(\"Spe*\",$C$1:$C$500,0)+R194)=0,\"\",INDEX($C$1:$C$500,MATCH(\"Spe*\",$C$1:$C$500,0)+R194))","v":""},{"$f":"IF(INDEX($C$1:$C$500,MATCH(\"Spe*\",$C$1:$C$500,0)+R194)=0,\"\",INDEX($D$1:$D$500,MATCH(\"Spe*\",$C$1:$C$500,0)+R194))","v":""},null,null,null,null,{"$error":"#N/A"},{"$error":"#N/A"}]
[null,null,null,null,null,{"$f":"F194+1","v":195},"","",null,null,null,null,{"$error":"#N/A"},{"$error":"#N/A"},null,null,null,{"$f":"R194+1","v":195},"","",null,null,null,null,{"$error":"#N/A"},{"$error":"#N/A"}]
[null,null,null,null,null,196,"","",null,null,null,null,{"$error":"#N/A"},{"$error":"#N/A"},null,null,null,196,"","",null,null,null,null,{"$error":"#N/A"},{"$error":"#N/A"}]
[null,null,null,null,null,197,"","",null,null,null,null,{"$error":"#N/A"},{"$error":"#N/A"},null,null,null,197,"","",null,null,null,null,{"$error":"#N/A"},{"$error":"#N/A"}]
[null,0,null,null,null,198,"","",null,null,null,null,{"$error":"#N/A"},{"$error":"#N/A"},null,null,null,198,"","",null,null,null,null,{"$error":"#N/A"},{"$error":"#N/A"}]
[null,0,null,null,null,199,"","",null,null,null,null,{"$error":"#N/A"},{"$error":"#N/A"},null,null,null,199,"","",null,null,null,null,{"$error":"#N/A"},{"$error":"#N/A"}]
[null,0,null,null,null,200,"","",null,null,null,null,{"$error":"#N/A"},{"$error":"#N/A"},null,null,null,200,"","",null,null,null,null,{"$error":"#N/A"},{"$error":"#N/A"}]
[null,0,null,null,null,201,"","",null,null,null,null,{"$error":"#N/A"},{"$error":"#N/A"},null,null,null,201,"","",null,null,null,null,{"$error":"#N/A"},{"$error":"#N/A"}]
[null,null,null,null,null,202,"","",null,null,null,null,{"$error":"#N/A"},{"$error":"#N/A"},null,null,null,202,"","",null,null,null,null,{"$error":"#N/A"},{"$error":"#N/A"}]
["Auflösung",null,null,null,null,203,"","",null,null,null,null,{"$error":"#N/A"},{"$error":"#N/A"},null,null,null,203,"","",null,null,null,null,{"$error":"#N/A"},{"$error":"#N/A"},null,null,null,null,null,null,null,null,null,null,null,null,null,"Auflösung"]
["Spektrum in [nm]",null,null,null,null,204,"","",null,null,null,null,{"$error":"#N/A"},{"$error":"#N/A"},null,null,null,204,"","",null,null,null,null,{"$error":"#N/A"},{"$error":"#N/A"},null,null,null,null,null,null,null,null,null,null,null,null,null,"Spektrum in [nm]"]
[380,1.7470250000000001,null,null,null,205,"","",null,null,null,null,{"$error":"#N/A"},{"$error":"#N/A"},null,null,null,205,"","",null,null,null,null,{"$error":"#N/A"},{"$error":"#N/A"},null,null,null,null,null,null,null,null,null,null,null,null,null,380]
[385,1.9551480000000001,null,null,null,206,"","",null,null,null,null,{"$error":"#N/A"},{"$error":"#N/A"},null,null,null,206,"","",null,null,null,null,{"$error":"#N/A"},{"$error":"#N/A"},null,null,null,null,null,null,null,null,null,null,null,null,null,385]
[390,2.3422209999999999,null,null,null,207,"","",null,null,null,null,{"$error":"#N/A"},{"$error":"#N/A"},null,null,null,207,"","",null,null,null,null,{"$error":"#N/A"},{"$error":"#N/A"},null,null,null,null,null,null,null,null,null,null,null,null,null,390]
[395,3.0443509999999998,null,null,null,208,"","",null,null,null,null,{"$error":"#N/A"},{"$error":"#N/A"},null,null,null,208,"","",null,null,null,null,{"$error":"#N/A"},{"$error":"#N/A"},null,null,null,null,null,null,null,null,null,null,null,null,null,395]
[400,4.4780259999999998,null,null,null,209,"","",null,null,null,null,{"$error":"#N/A"},{"$error":"#N/A"},null,null,null,209,"","",null,null,null,null,{"$error":"#N/A"},{"$error":"#N/A"},null,null,null,null,null,null,null,null,null,null,null,null,null,400]
[405,5.9537769999999997,null,null,null,210,"","",null,null,null,null,{"$error":"#N/A"},{"$error":"#N/A"},null,null,null,210,"","",null,null,null,null,{"$error":"#N/A"},{"$error":"#N/A"},null,null,null,null,null,null,null,null,null,null,null,null,null,405]
[410,6.9295419999999996,null,null,null,211,"","",null,null,null,null,{"$error":"#N/A"},{"$error":"#N/A"},null,null,null,211,"","",null,null,null,null,{"$error":"#N/A"},{"$error":"#N/A"},null,null,null,null,null,null,null,null,null,null,null,null,null,410]
[415,8.1653699999999994,null,null,null,212,"","",null,null,null,null,{"$error":"#N/A"},{"$error":"#N/A"},null,null,null,212,"","",null,null,null,null,{"$error":"#N/A"},{"$error":"#N/A"},null,null,null,null,null,null,null,null,null,null,null,null,null,415]
[420,8.8666110000000007,null,null,null,213,"","",null,null,null,null,{"$error":"#N/A"},{"$error":"#N/A"},null,null,null,213,"","",null,null,null,null,{"$error":"#N/A"},{"$error":"#N/A"},null,null,null,null,null,null,null,null,null,null,null,null,null,420]
[425,9.1403680000000005,null,null,null,214,"","",null,null,null,null,{"$error":"#N/A"},{"$error":"#N/A"},null,null,null,214,"","",null,null,null,null,{"$error":"#N/A"},{"$error":"#N/A"},null,null,null,null,null,null,null,null,null,null,null,null,null,425]
[430,9.2625890000000002,null,null,null,215,"","",null,null,null,null,{"$error":"#N/A"},{"$error":"#N/A"},null,null,null,215,"","",null,null,null,null,{"$error":"#N/A"},{"$error":"#N/A"},null,null,null,null,null,null,null,null,null,null,null,null,null,430]
[435,10.222623,null,null,null,216,"","",null,null,null,null,{"$error":"#N/A"},{"$error":"#N/A"},null,null,null,216,"","",null,null,null,null,{"$error":"#N/A"},{"$error":"#N/A"},null,null,null,null,null,null,null,null,null,null,null,null,null,435]
[440,11.434519999999999,null,null,null,217,"","",null,null,null,null,{"$error":"#N/A"},{"$error":"#N/A"},null,null,null,217,"","",null,null,null,null,{"$error":"#N/A"},{"$error":"#N/A"},null,null,null,null,null,null,null,null,null,null,null,null,null,440]
[445,12.582395999999999,null,null,null,218,"","",null,null,null,null,{"$error":"#N/A"},{"$error":"#N/A"},null,null,null,218,"","",null,null,null,null,{"$error":"#N/A"},{"$error":"#N/A"},null,null,null,null,null,null,null,null,null,null,null,null,null,445]
[450,13.676095,null,null,null,219,"","",null,null,null,null,{"$error":"#N/A"},{"$error":"#N/A"},null,null,null,219,"","",null,null,null,null,{"$error":"#N/A"},{"$error":"#N/A"},null,null,null,null,null,null,null,null,null,null,null,null,null,450]
[455,14.475695,null,null,null,220,"","",null,null,null,null,{"$error":"#N/A"},{"$error":"#N/A"},null,null,null,220,"","",null,null,null,null,{"$error":"#N/A"},{"$error":"#N/A"},null,null,null,null,null,null,null,null,null,null,null,null,null,455]
[460,14.90868,null,null,null,221,"","",null,null,null,null,{"$error":"#N/A"},{"$error":"#N/A"},null,null,null,221,"","",null,null,null,null,{"$error":"#N/A"},{"$error":"#N/A"},null,null,null,null,null,null,null,null,null,null,null,null,null,460]
[465,15.160750999999999,null,null,null,222,"","",null,null,null,null,{"$error":"#N/A"},{"$error":"#N/A"},null,null,null,222,"","",null,null,null,null,{"$error":"#N/A"},{"$error":"#N/A"},null,null,null,null,null,null,null,null,null,null,null,null,null,465]
[470,15.360201,null,null,null,223,"","",null,null,null,null,{"$error":"#N/A"},{"$error":"#N/A"},null,null,null,223,"","",null,null,null,null,{"$error":"#N/A"},{"$error":"#N/A"},null,null,null,null,null,null,null,null,null,null,null,null,null,470]
[475,15.666918000000001,null,null,null,224,"","",null,null,null,null,{"$error":"#N/A"},{"$error":"#N/A"},null,null,null,224,"","",null,null,null,null,{"$error":"#N/A"},{"$error":"#N/A"},null,null,null,null,null,null,null,null,null,null,null,null,null,475]
[480,15.932422000000001,null,null,null,225,"","",null,null,null,null,{"$error":"#N/A"},{"$error":"#N/A"},null,null,null,225,"","",null,null,null,null,{"$error":"#N/A"},{"$error":"#N/A"},null,null,null,null,null,null,null,null,null,null,null,null,null,480]
[485,15.754631,null,null,null,226,"","",null,null,null,null,{"$error":"#N/A"},{"$error":"#N/A"},null,null,null,226,"","",null,null,null,null,{"$f":"IF(S226=\"\",NA(),ROUND(S226,0))","v":{"$error":"#N/A"}},{"$f":"IF(T226=\"\",NA(),T226)","v":{"$error":"#N/A"}},null,null,null,null,null,null,null,null,null,null,null,null,null,485]
[490,15.870525000000001,null,null,null,227,"","",null,null,null,null,{"$error":"#N/A"},{"$error":"#N/A"},null,null,null,227,"","",null,null,null,null,{"$error":"#N/A"},{"$error":"#N/A"},null,null,null,null,null,null,null,null,null,null,null,null,null,490]
[495,16.288945999999999,null,null,null,228,"","",null,null,null,null,{"$error":"#N/A"},{"$error":"#N/A"},null,null,null,228,"","",null,null,null,null,{"$error":"#N/A"},{"$error":"#N/A"},null,null,null,null,null,null,null,null,null,null,null,null,null,495]
[500,16.311502000000001,null,null,null,229,"","",null,null,null,null,{"$error":"#N/A"},{"$error":"#N/A"},null,null,null,229,"","",null,null,null,null,{"$error":"#N/A"},{"$error":"#N/A"},null,null,null,null,null,null,null,null,null,null,null,null,null,500]
[505,16.393141,null,null,null,230,"","",null,null,null,null,{"$error":"#N/A"},{"$error":"#N/A"},null,null,null,230,"","",null,null,null,null,{"$error":"#N/A"},{"$error":"#N/A"},null,null,null,null,null,null,null,null,null,null,null,null,null,505]
[510,16.575796,null,null,null,231,"","",null,null,null,null,{"$error":"#N/A"},{"$error":"#N/A"},null,null,null,231,"","",null,null,null,null,{"$error":"#N/A"},{"$error":"#N/A"},null,null,null,null,null,null,null,null,null,null,null,null,null,510]
[515,16.400569999999998,null,null,null,232,"","",null,null,null,null,{"$error":"#N/A"},{"$error":"#N/A"},null,null,null,232,"","",null,null,null,null,{"$error":"#N/A"},{"$error":"#N/A"},null,null,null,null,null,null,null,null,null,null,null,null,null,515]
[520,16.492079,null,null,null,233,"","",null,null,null,null,{"$error":"#N/A"},{"$error":"#N/A"},null,null,null,233,"","",null,null,null,null,{"$error":"#N/A"},{"$error":"#N/A"},null,null,null,null,null,null,null,null,null,null,null,null,null,520]
[525,16.956896,null,null,null,234,"","",null,null,null,null,{"$error":"#N/A"},{"$error":"#N/A"},null,null,null,234,"","",null,null,null,null,{"$error":"#N/A"},{"$error":"#N/A"},null,null,null,null,null,null,null,null,null,null,null,null,null,525]
[530,17.308287,null,null,null,235,"","",null,null,null,null,{"$error":"#N/A"},{"$error":"#N/A"},null,null,null,235,"","",null,null,null,null,{"$error":"#N/A"},{"$error":"#N/A"},null,null,null,null,null,null,null,null,null,null,null,null,null,530]
[535,17.530825,null,null,null,236,"","",null,null,null,null,{"$error":"#N/A"},{"$error":"#N/A"},null,null,null,236,"","",null,null,null,null,{"$error":"#N/A"},{"$error":"#N/A"},null,null,null,null,null,null,null,null,null,null,null,null,null,535]
[540,17.427284,null,null,null,237,"","",null,null,null,null,{"$error":"#N/A"},{"$error":"#N/A"},null,null,null,237,"","",null,null,null,null,{"$error":"#N/A"},{"$error":"#N/A"},null,null,null,null,null,null,null,null,null,null,null,null,null,540]
[545,17.464561,null,null,null,238,"","",null,null,null,null,{"$error":"#N/A"},{"$error":"#N/A"},null,null,null,238,"","",null,null,null,null,{"$error":"#N/A"},{"$error":"#N/A"},null,null,null,null,null,null,null,null,null,null,null,null,null,545]
[550,17.491382999999999,null,null,null,239,"","",null,null,null,null,{"$error":"#N/A"},{"$error":"#N/A"},null,null,null,239,"","",null,null,null,null,{"$error":"#N/A"},{"$error":"#N/A"},null,null,null,null,null,null,null,null,null,null,null,null,null,550]
[555,17.440124999999998,null,null,null,240,"","",null,null,null,null,{"$error":"#N/A"},{"$error":"#N/A"},null,null,null,240,"","",null,null,null,null,{"$error":"#N/A"},{"$error":"#N/A"},null,null,null,null,null,null,null,null,null,null,null,null,null,555]
[560,17.214663000000002,null,null,null,241,"","",null,null,null,null,{"$error":"#N/A"},{"$error":"#N/A"},null,null,null,241,"","",null,null,null,null,{"$error":"#N/A"},{"$error":"#N/A"},null,null,null,null,null,null,null,null,null,null,null,null,null,560]
[565,16.857655000000001,null,null,null,242,"","",null,null,null,null,{"$error":"#N/A"},{"$error":"#N/A"},null,null,null,242,"","",null,null,null,null,{"$error":"#N/A"},{"$error":"#N/A"},null,null,null,null,null,null,null,null,null,null,null,null,null,565]
[570,16.620396,null,null,null,243,"","",null,null,null,null,{"$error":"#N/A"},{"$error":"#N/A"},null,null,null,243,"","",null,null,null,null,{"$error":"#N/A"},{"$error":"#N/A"},null,null,null,null,null,null,null,null,null,null,null,null,null,570]
[575,16.517523000000001,null,null,null,244,"","",null,null,null,null,{"$error":"#N/A"},{"$error":"#N/A"},null,null,null,244,"","",null,null,null,null,{"$error":"#N/A"},{"$error":"#N/A"},null,null,null,null,null,null,null,null,null,null,null,null,null,575]
[580,16.530363000000001,null,null,null,245,"","",null,null,null,null,{"$error":"#N/A"},{"$error":"#N/A"},null,null,null,245,"","",null,null,null,null,{"$error":"#N/A"},{"$error":"#N/A"},null,null,null,null,null,null,null,null,null,null,null,null,null,580]
[585,16.294405000000001,null,null,null,246,"","",null,null,null,null,{"$error":"#N/A"},{"$error":"#N/A"},null,null,null,246,"","",null,null,null,null,{"$error":"#N/A"},{"$error":"#N/A"},null,null,null,null,null,null,null,null,null,null,null,null,null,585]
[590,15.751006,null,null,null,247,"","",null,null,null,null,{"$error":"#N/A"},{"$error":"#N/A"},null,null,null,247,"","",null,null,null,null,{"$error":"#N/A"},{"$error":"#N/A"},null,null,null,null,null,null,null,null,null,null,null,null,null,590]
[595,15.803174,null,null,null,248,"","",null,null,null,null,{"$error":"#N/A"},{"$error":"#N/A"},null,null,null,248,"","",null,null,null,null,{"$error":"#N/A"},{"$error":"#N/A"},null,null,null,null,null,null,null,null,null,null,null,null,null,595]
[600,16.115704000000001,null,null,null,249,"","",null,null,null,null,{"$error":"#N/A"},{"$error":"#N/A"},null,null,null,249,"","",null,null,null,null,{"$error":"#N/A"},{"$error":"#N/A"},null,null,null,null,null,null,null,null,null,null,null,null,null,600]
[605,16.306222999999999,null,null,null,250,"","",null,null,null,null,{"$error":"#N/A"},{"$error":"#N/A"},null,null,null,250,"","",null,null,null,null,{"$error":"#N/A"},{"$error":"#N/A"},null,null,null,null,null,null,null,null,null,null,null,null,null,605]
[610,16.259893000000002,null,null,null,251,"","",null,null,null,null,{"$error":"#N/A"},{"$error":"#N/A"},null,null,null,251,"","",null,null,null,null,{"$error":"#N/A"},{"$error":"#N/A"},null,null,null,null,null,null,null,null,null,null,null,null,null,610]
[615,16.116161000000002,null,null,null,252,"","",null,null,null,null,{"$error":"#N/A"},{"$error":"#N/A"},null,null,null,252,"","",null,null,null,null,{"$error":"#N/A"},{"$error":"#N/A"},null,null,null,null,null,null,null,null,null,null,null,null,null,615]
[620,16.033514,null,null,null,253,"","",null,null,null,null,{"$error":"#N/A"},{"$error":"#N/A"},null,null,null,253,"","",null,null,null,null,{"$error":"#N/A"},{"$error":"#N/A"},null,null,null,null,null,null,null,null,null,null,null,null,null,620]
[625,15.820515,null,null,null,254,"","",null,null,null,null,{"$error":"#N/A"},{"$error":"#N/A"},null,null,null,254,"","",null,null,null,null,{"$error":"#N/A"},{"$error":"#N/A"},null,null,null,null,null,null,null,null,null,null,null,null,null,625]
[630,15.616255000000001,null,null,null,255,"","",null,null,null,null,{"$error":"#N/A"},{"$error":"#N/A"},null,null,null,255,"","",null,null,null,null,{"$error":"#N/A"},{"$error":"#N/A"},null,null,null,null,null,null,null,null,null,null,null,null,null,630]
[635,15.801816000000001,null,null,null,256,"","",null,null,null,null,{"$error":"#N/A"},{"$error":"#N/A"},null,null,null,256,"","",null,null,null,null,{"$error":"#N/A"},{"$error":"#N/A"},null,null,null,null,null,null,null,null,null,null,null,null,null,635]
[640,15.819179999999999,null,null,null,257,"","",null,null,null,null,{"$error":"#N/A"},{"$error":"#N/A"},null,null,null,257,"","",null,null,null,null,{"$error":"#N/A"},{"$error":"#N/A"},null,null,null,null,null,null,null,null,null,null,null,null,null,640]
[645,15.523285,null,null,null,258,{"$f":"IF(INDEX($A$1:$A$500,MATCH(\"Spe*\",$A$1:$A$500,0)+F258)=0,\"\",INDEX($A$1:$A$500,MATCH(\"Spe*\",$A$1:$A$500,0)+F258))","v":""},{"$f":"IF(INDEX($A$1:$A$500,MATCH(\"Spe*\",$A$1:$A$500,0)+F258)=0,\"\",INDEX($B$1:$B$500,MATCH(\"Spe*\",$A$1:$A$500,0)+F258))","v":""},null,null,null,null,{"$f":"IF(G258=\"\",NA(),ROUND(G258,0))","v":{"$error":"#N/A"}},{"$f":"IF(H258=\"\",NA(),H258)","v":{"$error":"#N/A"}},null,null,null,258,{"$f":"IF(INDEX($C$1:$C$500,MATCH(\"Spe*\",$C$1:$C$500,0)+R258)=0,\"\",INDEX($C$1:$C$500,MATCH(\"Spe*\",$C$1:$C$500,0)+R258))","v":""},{"$f":"IF(INDEX($C$1:$C$500,MATCH(\"Spe*\",$C$1:$C$500,0)+R258)=0,\"\",INDEX($D$1:$D$500,MATCH(\"Spe*\",$C$1:$C$500,0)+R258))","v":""},null,null,null,null,{"$error":"#N/A"},{"$error":"#N/A"},null,null,null,null,null,null,null,null,null,null,null,null,null,645]
[650,15.154457000000001,null,null,null,null,null,null,null,null,null,null,null,null,null,null,null,null,null,null,null,null,null,null,null,null,null,null,null,null,null,null,null,null,null,null,null,null,null,650]
[655,15.060684999999999,null,null,null,null,null,null,null,null,null,null,null,null,null,null,null,null,null,null,null,null,null,null,null,null,null,null,null,null,null,null,null,null,null,null,null,null,null,655]
[660,15.393768,null,null,null,null,null,null,null,null,null,null,null,null,null,null,null,null,null,null,null,null,null,null,null,null,null,null,null,null,null,null,null,null,null,null,null,null,null,660]
[665,15.698565,null,null,null,null,null,null,null,null,null,null,null,null,null,null,null,null,null,null,null,null,null,null,null,null,null,null,null,null,null,null,null,null,null,null,null,null,null,665]
[670,15.748817000000001,null,null,null,null,null,null,null,null,null,null,null,null,null,null,null,null,null,null,null,null,null,null,null,null,null,null,null,null,null,null,null,null,null,null,null,null,null,670]
[675,15.637076,null,null,null,null,null,null,null,null,null,null,null,null,null,null,null,null,null,null,null,null,null,null,null,null,null,null,null,null,null,null,null,null,null,null,null,null,null,675]
[680,15.248099,null,null,null,null,null,null,null,null,null,null,null,null,null,null,null,null,null,null,null,null,null,null,null,null,null,null,null,null,null,null,null,null,null,null,null,null,null,680]
[685,14.304793,null,null,null,null,null,null,null,null,null,null,null,null,null,null,null,null,null,null,null,null,null,null,null,null,null,null,null,null,null,null,null,null,null,null,null,null,null,685]
[690,13.662929999999999,null,null,null,null,null,null,null,null,null,null,null,null,null,null,null,null,null,null,null,null,null,null,null,null,null,null,null,null,null,null,null,null,null,null,null,null,null,690]
[695,14.074071,null,null,null,null,null,null,null,null,null,null,null,null,null,null,null,null,null,null,null,null,null,null,null,null,null,null,null,null,null,null,null,null,null,null,null,null,null,695]
[700,14.629459000000001,null,null,null,null,null,null,null,null,null,null,null,null,null,null,null,null,null,null,null,null,null,null,null,null,null,null,null,null,null,null,null,null,null,null,null,null,null,700]
[705,15.202375,null,null,null,null,null,null,null,null,null,null,null,null,null,null,null,null,null,null,null,null,null,null,null,null,null,null,null,null,null,null,null,null,null,null,null,null,null,705]
[710,15.358993999999999,null,null,null,null,null,null,null,null,null,null,null,null,null,null,null,null,null,null,null,null,null,null,null,null,null,null,null,null,null,null,null,null,null,null,null,null,null,710]
[715,14.246861000000001,null,null,null,null,null,null,null,null,null,null,null,null,null,null,null,null,null,null,null,null,null,null,null,null,null,null,null,null,null,null,null,null,null,null,null,null,null,715]
[720,13.123232,null,null,null,null,null,null,null,null,null,null,null,null,null,null,null,null,null,null,null,null,null,null,null,null,null,null,null,null,null,null,null,null,null,null,null,null,null,720]
[725,13.262581000000001,null,null,null,null,null,null,null,null,null,null,null,null,null,null,null,null,null,null,null,null,null,null,null,null,null,null,null,null,null,null,null,null,null,null,null,null,null,725]
[730,14.46374,null,null,null,null,null,null,null,null,null,null,null,null,null,null,null,null,null,null,null,null,null,null,null,null,null,null,null,null,null,null,null,null,null,null,null,null,null,730]
[735,16.200191,null,null,null,null,null,null,null,null,null,null,null,null,null,null,null,null,null,null,null,null,null,null,null,null,null,null,null,null,null,null,null,null,null,null,null,null,null,735]
[740,17.517562999999999,null,null,null,null,null,null,null,null,null,null,null,null,null,null,null,null,null,null,null,null,null,null,null,null,null,null,null,null,null,null,null,null,null,null,null,null,null,740]
[745,18.14922,null,null,null,null,null,null,null,null,null,null,null,null,null,null,null,null,null,null,null,null,null,null,null,null,null,null,null,null,null,null,null,null,null,null,null,null,null,745]
[750,18.020264000000001,null,null,null,null,null,null,null,null,null,null,null,null,null,null,null,null,null,null,null,null,null,null,null,null,null,null,null,null,null,null,null,null,null,null,null,null,null,750]
[755,15.876512999999999,null,null,null,null,null,null,null,null,null,null,null,null,null,null,null,null,null,null,null,null,null,null,null,null,null,null,null,null,null,null,null,null,null,null,null,null,null,755]
[760,12.366732000000001,null,null,null,null,null,null,null,null,null,null,null,null,null,null,null,null,null,null,null,null,null,null,null,null,null,null,null,null,null,null,null,null,null,null,null,null,null,760]
[765,12.548769999999999,null,null,null,null,null,null,null,null,null,null,null,null,null,null,null,null,null,null,null,null,null,null,null,null,null,null,null,null,null,null,null,null,null,null,null,null,null,765]
[770,15.813597,null,null,null,null,null,null,null,null,null,null,null,null,null,null,null,null,null,null,null,null,null,null,null,null,null,null,null,null,null,null,null,null,null,null,null,null,null,770]
[775,17.428082,null,null,null,null,null,null,null,null,null,null,null,null,null,null,null,null,null,null,null,null,null,null,null,null,null,null,null,null,null,null,null,null,null,null,null,null,null,775]
[780,17.473745000000001,null,null,null,null,null,null,null,null,null,null,null,null,null,null,null,null,null,null,null,null,null,null,null,null,null,null,null,null,null,null,null,null,null,null,null,null,null,780]

{"sheet":"Version 2.2 Lite","index":5,"n_rows":0,"n_cols":0,"rows_kept":0,"cut":false,"hidden":false,"merged":[]}