{"text_format":"1","workbook":"xlsx","n_sheets":9,"sheets":["Protocol 1 (5nm)","Protocol 2 (native)","Protocol 3","Protocol TM30","Protocol Flicker","Protocol TLCI","Reference Comparison","Data","Version 2.3 Base"],"not_rendered":{"charts":18,"images":18,"macros":1,"external_links":0,"defined_names":7,"comments":0,"pivot_tables":0},"unopened":[],"bounds":{"document_bytes":16777216,"sheet_cells":100000,"rows_first":2000,"rows_last":500,"rows_between":2000,"halvings":0,"cell_chars":16384,"cell_head_chars":4096},"cells_cut":0,"cells_raw":0,"read":"whole","date_system":"1900"}

{"sheet":"Protocol 1 (5nm)","index":0,"n_rows":58,"n_cols":94,"rows_kept":58,"cut":false,"hidden":false,"merged":[[4,62,4,83],[3,0,3,12],[49,8,49,15],[42,44,42,49],[55,0,55,26],[50,36,50,43],[47,2,47,7],[50,16,50,21],[50,2,50,7],[47,16,47,21],[54,0,54,26],[53,0,53,26],[51,78,51,85],[33,3,33,7],[33,8,33,9],[48,8,48,15],[47,8,47,15],[51,72,51,77],[51,30,51,35],[51,8,51,15],[51,2,51,7],[51,16,51,21],[51,22,51,29],[48,2,48,7],[57,63,57,83],[57,84,57,101],[0,0,1,53],[49,86,49,91],[48,86,48,91],[49,92,49,99],[48,92,48,99],[40,92,40,99],[40,86,40,91],[39,92,39,99],[39,86,39,91],[44,92,44,99],[44,86,44,91],[57,15,57,26],[49,78,49,85],[4,84,4,99],[5,84,5,99],[3,62,3,83],[5,62,5,83],[45,16,45,21],[45,22,45,29],[46,16,46,21],[46,22,46,29],[49,2,49,7],[50,30,50,35],[50,8,50,15],[22,22,22,23],[26,3,26,7],[27,3,27,7],[23,3,23,7],[24,3,24,7],[25,3,25,7],[33,10,33,15],[39,8,39,15],[31,3,31,7],[48,16,48,21],[49,16,49,21],[49,22,49,29],[22,24,22,31],[23,24,23,31],[24,24,24,31],[26,17,26,21],[26,22,26,23],[26,24,26,31],[22,3,22,7],[36,10,36,15],[44,16,44,21],[46,30,46,35],[51,58,51,63],[51,64,51,71],[49,58,49,63],[49,64,49,71],[50,58,50,63],[50,64,50,71],[51,36,51,43],[50,22,50,29],[40,36,40,43],[41,30,41,35],[41,36,41,43],[40,30,40,35],[44,22,44,29],[48,22,48,29],[44,30,44,35],[51,44,51,49],[51,50,51,57],[41,22,41,29],[42,30,42,35],[48,30,48,35],[50,50,50,57],[46,64,46,71],[47,58,47,63],[47,64,47,71],[50,44,50,49],[45,50,45,57],[45,58,45,63],[47,50,47,57],[48,50,48,57],[49,50,49,57],[48,58,48,63],[48,64,48,71],[31,8,31,9],[31,10,31,15],[46,8,46,15],[40,50,40,57],[41,50,41,57],[39,30,39,35],[43,22,43,29],[40,22,40,29],[41,16,41,21],[43,58,43,63],[43,64,43,71],[44,58,44,63],[44,50,44,57],[43,44,43,49],[42,50,42,57],[42,36,42,43],[49,30,49,35],[49,36,49,43],[45,30,45,35],[45,36,45,43],[48,44,48,49],[49,44,49,49],[45,44,45,49],[46,36,46,43],[47,30,47,35],[47,36,47,43],[47,44,47,49],[46,44,46,49],[48,36,48,43],[43,92,43,99],[36,86,36,90],[46,72,46,77],[46,78,46,85],[43,50,43,57],[44,64,44,71],[46,2,46,7],[44,2,44,7],[45,8,45,15],[44,44,44,49],[40,2,40,7],[39,2,39,7],[41,2,41,7],[36,3,36,7],[42,2,42,7],[43,2,43,7],[36,8,36,9],[45,2,45,7],[42,8,42,15],[43,8,43,15],[44,8,44,15],[40,8,40,15],[41,8,41,15],[51,86,51,91],[51,92,51,99],[36,65,36,81],[35,65,35,81],[31,65,31,81],[32,65,32,81],[39,72,39,77],[39,78,39,85],[40,72,40,77],[40,78,40,85],[41,72,41,77],[41,78,41,85],[42,72,42,77],[42,78,42,85],[48,72,48,77],[48,78,48,85],[41,86,41,91],[41,92,41,99],[34,86,34,98],[50,92,50,99],[46,86,46,91],[46,92,46,99],[32,89,32,90],[45,86,45,91],[50,86,50,91],[35,86,35,90],[40,58,40,63],[40,64,40,71],[41,58,41,63],[41,64,41,71],[42,86,42,91],[42,92,42,99],[43,86,43,91],[50,78,50,85],[49,72,49,77],[50,72,50,77],[46,58,46,63],[42,58,42,63],[42,64,42,71],[39,58,39,63],[39,64,39,71],[47,78,47,85],[43,72,43,77],[43,78,43,85],[44,72,44,77],[44,78,44,85],[45,92,45,99],[45,64,45,71],[31,89,31,90],[27,65,27,81],[23,89,23,90],[24,89,24,90],[28,17,29,31],[30,17,30,31],[26,65,26,81],[47,86,47,91],[47,92,47,99],[32,86,32,88],[46,50,46,57],[23,91,23,98],[24,91,24,98],[27,91,27,98],[28,91,28,98],[31,91,31,98],[32,91,32,98],[35,91,35,92],[35,93,35,98],[36,91,36,92],[36,93,36,98],[31,34,31,64],[32,34,32,64],[27,86,27,88],[25,10,25,15],[26,10,26,15],[27,10,27,15],[31,86,31,88],[29,10,29,15],[22,65,22,81],[29,65,29,81],[22,17,22,21],[23,65,23,81],[24,22,24,23],[28,86,28,88],[45,72,45,77],[45,78,45,85],[39,36,39,43],[47,72,47,77],[34,65,34,81],[35,34,35,64],[36,34,36,64],[34,34,34,64],[39,16,39,21],[39,22,39,29],[40,16,40,21],[44,36,44,43],[42,16,42,21],[42,22,42,29],[43,16,43,21],[39,44,39,49],[41,44,41,49],[39,50,39,57],[40,44,40,49],[43,30,43,35],[43,36,43,43],[47,22,47,29],[57,0,57,14],[34,3,34,7],[34,8,34,9],[34,10,34,15],[35,3,35,7],[35,8,35,9],[35,10,35,15],[22,8,22,9],[23,8,23,9],[24,8,24,9],[25,8,25,9],[26,8,26,9],[27,8,27,9],[32,3,32,7],[32,8,32,9],[32,10,32,15],[29,3,29,7],[28,8,28,9],[28,10,28,15],[30,8,30,9],[30,3,30,7],[30,10,30,15],[29,8,29,9],[28,3,28,7],[3,84,3,99],[22,34,22,64],[23,34,23,64],[24,34,24,64],[26,34,26,64],[27,34,27,64],[29,34,29,64],[3,13,3,58],[30,86,30,98],[26,86,26,98],[22,86,22,98],[23,86,23,88],[24,86,24,88],[4,13,4,58],[5,13,5,58],[22,10,22,15],[23,10,23,15],[24,10,24,15],[24,65,24,81],[23,17,23,21],[23,22,23,23],[24,17,24,21],[27,89,27,90],[28,89,28,90]]}
[{"$f":"IF(Data!$AE$2=\"DE\",\"Messprotokoll\",IF(Data!$AE$2=\"UK\",\"Measurement protocol\",IF(Data!$AE$2=\"FR\",\"Rapport de mesure\",\"Language Error\")))","v":"Measurement protocol"}]
[]
[]
[{"$f":"IF(Data!$AE$2 = \"DE\", \"Prüfling:\", IF(Data!$AE$2 = \"UK\",\"Test object:\",IF(Data!$AE$2=\"FR\",\"Objet testé:\",\"Language Error\")))","v":"Test object:"},null,null,null,null,null,null,null,null,null,null,null,null,{"$f":"IF(Data!$AE$2=\"DE\",\"Hersteller\",IF(Data!$AE$2=\"UK\",\"Manufacturer\",IF(Data!$AE$2=\"FR\",\"Fabricant\",\"Language Error\")))","v":"Manufacturer"},null,null,null,null,null,null,null,null,null,null,null,null,null,null,null,null,null,null,null,null,null,null,null,null,null,null,null,null,null,null,null,null,null,null,null,null,null,null,null,null,null,null,null,null,null,null,null,null,{"$f":"IF(Data!$AE$2=\"DE\",\"Messdatei:\",IF(Data!$AE$2=\"UK\",\"Measurement file:\",IF(Data!$AE$2=\"FR\",\"Fichier de mesure:\",\"Language Error\")))","v":"Measurement file:"},null,null,null,null,null,null,null,null,null,null,null,null,null,null,null,null,null,null,null,null,null,{"$f":"Data!Q18","v":"Measured"}]
[null,null,null,null,null,null,null,null,null,null,null,null,null,{"$f":"IF(Data!$AE$2=\"DE\",\"Typ\",IF(Data!$AE$2=\"UK\",\"Type\",IF(Data!$AE$2=\"FR\",\"Type\",\"Language Error\")))","v":"Type"},null,null,null,null,null,null,null,null,null,null,null,null,null,null,null,null,null,null,null,null,null,null,null,null,null,null,null,null,null,null,null,null,null,null,null,null,null,null,null,null,null,null,null,null,null,null,null,null,{"$f":"IF(Data!$AE$2=\"DE\",\"Datum der Messung:\",IF(Data!$AE$2=\"UK\",\"Date of measurement:\",IF(Data!$AE$2=\"FR\",\"Date de mesure:\",\"Language Error\")))","v":"Date of measurement:"},null,null,null,null,null,null,null,null,null,null,null,null,null,null,null,null,null,null,null,null,null,{"$f":"Data!Q23","v":"22.04.2024"}]
[null,null,null,null,null,null,null,null,null,null,null,null,null,{"$f":"IF(Data!$AE$2=\"DE\",\"Modell\",IF(Data!$AE$2=\"UK\",\"Model\",IF(Data!$AE$2=\"FR\",\"Article\",\"Language Error\")))","v":"Model"},null,null,null,null,null,null,null,null,null,null,null,null,null,null,null,null,null,null,null,null,null,null,null,null,null,null,null,null,null,null,null,null,null,null,null,null,null,null,null,null,null,null,null,null,null,null,null,null,{"$f":"IF(Data!$AE$2=\"DE\",\"Uhrzeit der Messung:\",IF(Data!$AE$2=\"UK\",\"Time of measurement:\",IF(Data!$AE$2=\"FR\",\"Heure de mesure:\",\"Language Error\")))","v":"Time of measurement:"},null,null,null,null,null,null,null,null,null,null,null,null,null,null,null,null,null,null,null,null,null,{"$f":"Data!Q21","v":"14:26:00"}]
[]
[]
[]
[]
[]
[]
[]
[]
[]
[]
[]
[]
[]
[]
[]
[]
[null,null,null,"R1",null,null,null,null,"=",null,{"$f":"Data!K2","v":96.71},null,null,null,null,null,null,"Ra",null,null,null,null,"=",null,{"$f":"Data!K1","v":97.45},null,null,null,null,null,null,null,null,null,{"$f":"IF(Data!$AE$2=\"DE\",\"Beleuchtungsstärke\",IF(Data!$AE$2=\"UK\",\"Illuminance\",IF(Data!$AE$2=\"FR\",\"Illuminance\",\"Language Error\")))","v":"Illuminance"},null,null,null,null,null,null,null,null,null,null,null,null,null,null,null,null,null,null,null,null,null,null,null,null,null,null,null,null,null,null,{"$f":"Data!K33","v":618.20000000000005},null,null,null,null,null,null,null,null,null,null,null,null,null,null,null,null,null,null,null,null,{"$f":"IF(CI24=\"x\",\"CIE1931\",IF(CI24=\"u'\",\"CIE1976\",IF(CI24=\"u\",\"CIE1960\",\"\")))","v":"CIE1931"}]
[null,null,null,"R2",null,null,null,null,"=",null,{"$f":"Data!K3","v":98.33},null,null,null,null,null,null,"Re",null,null,null,null,"=",null,{"$f":"Data!Q27","v":96.51},null,null,null,null,null,null,null,null,null,"Ee",null,null,null,null,null,null,null,null,null,null,null,null,null,null,null,null,null,null,null,null,null,null,null,null,null,null,null,null,null,null,{"$f":"Data!Q25","v":2.9710000000000001},null,null,null,null,null,null,null,null,null,null,null,null,null,null,null,null,null,null,null,null,{"$f":"Data!J23","v":"x"},null,null,"=",null,{"$f":"Data!K23","v":0.31859999999999999}]
[null,null,null,"R3",null,null,null,null,"=",null,{"$f":"Data!K4","v":99.17},null,null,null,null,null,null,"GAI",null,null,null,null,"=",null,{"$f":"Data!Q28","v":732},null,null,null,null,null,null,null,null,null,"LER",null,null,null,null,null,null,null,null,null,null,null,null,null,null,null,null,null,null,null,null,null,null,null,null,null,null,null,null,null,null,{"$f":"Data!Q26","v":208.07808818579605},null,null,null,null,null,null,null,null,null,null,null,null,null,null,null,null,null,null,null,null,{"$f":"Data!J24","v":"y"},null,null,"=",null,{"$f":"Data!K24","v":0.34010000000000001}]
[null,null,null,"R4",null,null,null,null,"=",null,{"$f":"Data!K5","v":96.5}]
[null,null,null,"R5",null,null,null,null,"=",null,{"$f":"Data!K6","v":96.93},null,null,null,null,null,null,"TLCI",null,null,null,null,"=",null,{"$f":"Data!Q30","v":100},null,null,null,null,null,null,null,null,null,{"$f":"IF(Data!$AE$2 = \"DE\", \"Ähnlichste Farbtemperatur (CCT)\", IF(Data!$AE$2 = \"UK\",\"Correlated Color Temperature (CCT)\",IF(Data!$AE$2=\"FR\",\"Temp. de couleur proximale (CCT)\",\"Language Error\")))","v":"Correlated Color Temperature (CCT)"},null,null,null,null,null,null,null,null,null,null,null,null,null,null,null,null,null,null,null,null,null,null,null,null,null,null,null,null,null,null,{"$f":"Data!K30","v":6137},null,null,null,null,null,null,null,null,null,null,null,null,null,null,null,null,null,null,null,null,{"$f":"IF(CI28=\"x\",\"CIE1931\",IF(CI28=\"u'\",\"CIE1976\",IF(CI28=\"u\",\"CIE1960\",\"\")))","v":"CIE1976"}]
[null,null,null,"R6",null,null,null,null,"=",null,{"$f":"Data!K7","v":98.08},null,null,null,null,null,null,null,null,null,null,null,null,null,null,null,null,null,null,null,null,null,null,null,"Duv",null,null,null,null,null,null,null,null,null,null,null,null,null,null,null,null,null,null,null,null,null,null,null,null,null,null,null,null,null,null,{"$f":"Data!K31","v":5.8999999999999999E-3},null,null,null,null,null,null,null,null,null,null,null,null,null,null,null,null,null,null,null,null,{"$f":"Data!J25","v":"u'"},null,null,"=",null,{"$f":"Data!K25","v":0.1978}]
[null,null,null,"R7",null,null,null,null,"=",null,{"$f":"Data!K8","v":98.45},null,null,null,null,null,null,"PPFD\n[µmol/m²s]",null,null,null,null,null,null,null,null,null,null,null,null,null,null,null,null,null,null,null,null,null,null,null,null,null,null,null,null,null,null,null,null,null,null,null,null,null,null,null,null,null,null,null,null,null,null,null,null,null,null,null,null,null,null,null,null,null,null,null,null,null,null,null,null,null,null,null,null,{"$f":"Data!J26","v":"v'"},null,null,"=",null,{"$f":"Data!K26","v":0.47499999999999998}]
[null,null,null,"R8",null,null,null,null,"=",null,{"$f":"Data!K9","v":95.4},null,null,null,null,null,null,null,null,null,null,null,null,null,null,null,null,null,null,null,null,null,null,null,{"$f":"IF(Data!$AE$2 = \"DE\", \"Farbreinheit\",IF(Data!$AE$2 = \"UK\",\"Saturation\",IF(Data!$AE$2=\"FR\",\"Saturation\",\"Language Error\")))","v":"Saturation"},null,null,null,null,null,null,null,null,null,null,null,null,null,null,null,null,null,null,null,null,null,null,null,null,null,null,null,null,null,null,{"$f":"Data!K39","v":4.5999999999999996}]
[null,null,null,"R9",null,null,null,null,"=",null,{"$f":"Data!K10","v":86.96},null,null,null,null,null,null,{"$f":"Data!K142","v":10.76},null,null,null,null,null,null,null,null,null,null,null,null,null,null,null,null,null,null,null,null,null,null,null,null,null,null,null,null,null,null,null,null,null,null,null,null,null,null,null,null,null,null,null,null,null,null,null,null,null,null,null,null,null,null,null,null,null,null,null,null,null,null,null,null,null,null,null,null,{"$f":"IF(CI32=\"x\",\"CIE1931\",IF(CI32=\"u'\",\"CIE1976\",IF(CI32=\"u\",\"CIE1960\",\"\")))","v":"CIE1960"}]
[null,null,null,"R10",null,null,null,null,"=",null,{"$f":"Data!K11","v":96.71},null,null,null,null,null,null,null,null,null,null,null,null,null,null,null,null,null,null,null,null,null,null,null,{"$f":"IF(Data!$AE$2 = \"DE\", \"Dominante Wellenlänge\", IF(Data!$AE$2 = \"UK\", \"Dominant wavelength\",IF(Data!$AE$2=\"FR\",\"Longueur d'onde dominante (λD)\",\"Language Error\")))","v":"Dominant wavelength"},null,null,null,null,null,null,null,null,null,null,null,null,null,null,null,null,null,null,null,null,null,null,null,null,null,null,null,null,null,null,{"$f":"Data!K40 & \" nm\"","v":"495 nm"},null,null,null,null,null,null,null,null,null,null,null,null,null,null,null,null,null,null,null,null,{"$f":"Data!J27","v":"u"},null,null,"=",null,{"$f":"Data!K27","v":0.1978}]
[null,null,null,"R11",null,null,null,null,"=",null,{"$f":"Data!K12","v":96.02},null,null,null,null,null,null,null,null,null,null,null,null,null,null,null,null,null,null,null,null,null,null,null,{"$f":"IF(Data!$AE$2 = \"DE\", \"Peak-Wellenlänge\",IF(Data!$AE$2 = \"UK\", \"Peak wavelength\",IF(Data!$AE$2=\"FR\",\"Pic courbe spectrale (λP)\",\"Language Error\")))","v":"Peak wavelength"},null,null,null,null,null,null,null,null,null,null,null,null,null,null,null,null,null,null,null,null,null,null,null,null,null,null,null,null,null,null,{"$f":"Data!K20 & \" nm\"","v":"459 nm"},null,null,null,null,null,null,null,null,null,null,null,null,null,null,null,null,null,null,null,null,{"$f":"Data!J28","v":"v"},null,null,"=",null,{"$f":"Data!K28","v":0.31669999999999998}]
[null,null,null,"R12",null,null,null,null,"=",null,{"$f":"Data!K13","v":96.51}]
[null,null,null,"R13",null,null,null,null,"=",null,{"$f":"Data!K14","v":97.05},null,null,null,null,null,null,null,null,null,null,null,null,null,null,null,null,null,null,null,null,null,null,null,{"$f":"IF(Data!$AE$2 = \"DE\", \"Flickerfrequenz\", IF(Data!$AE$2 = \"UK\",\"Flicker frequency\",IF(Data!$AE$2=\"FR\",\"Fréquence flicker\",\"Language Error\")))","v":"Flicker frequency"},null,null,null,null,null,null,null,null,null,null,null,null,null,null,null,null,null,null,null,null,null,null,null,null,null,null,null,null,null,null,{"$f":"Data!K36","v":0},null,null,null,null,null,null,null,null,null,null,null,null,null,null,null,null,null,null,null,null,"TM30"]
[null,null,null,"R14",null,null,null,null,"=",null,{"$f":"Data!K15","v":99.3},null,null,null,null,null,null,null,null,null,null,null,null,null,null,null,null,null,null,null,null,null,null,null,{"$f":"IF(Data!$AE$2 = \"DE\", \"Prozent Flicker\", IF(Data!$AE$2 = \"UK\",\"Percent Flicker\",IF(Data!$AE$2=\"FR\",\"% flicker\",\"Language Error\")))","v":"Percent Flicker"},null,null,null,null,null,null,null,null,null,null,null,null,null,null,null,null,null,null,null,null,null,null,null,null,null,null,null,null,null,null,{"$f":"Data!K37","v":1.052689},null,null,null,null,null,null,null,null,null,null,null,null,null,null,null,null,null,null,null,null,"Rf",null,null,null,null,"=",null,{"$f":"Data!K43","v":0}]
[null,null,null,"R15",null,null,null,null,"=",null,{"$f":"Data!K16","v":95.47},null,null,null,null,null,null,null,null,null,null,null,null,null,null,null,null,null,null,null,null,null,null,null,{"$f":"IF(Data!$AE$2 = \"DE\", \"Flickerindex\", IF(Data!$AE$2 = \"UK\",\"Flicker index\",IF(Data!$AE$2=\"FR\",\"Index flicker\",\"Language Error\")))","v":"Flicker index"},null,null,null,null,null,null,null,null,null,null,null,null,null,null,null,null,null,null,null,null,null,null,null,null,null,null,null,null,null,null,{"$f":"Data!K35","v":1.261E-3},null,null,null,null,null,null,null,null,null,null,null,null,null,null,null,null,null,null,null,null,"Rg",null,null,null,null,"=",null,{"$f":"Data!K44","v":0}]
[]
[]
[null,null,"[nm]",null,null,null,null,null,"mW/m²/nm",null,null,null,null,null,null,null,"[nm]",null,null,null,null,null,"mW/m²/nm",null,null,null,null,null,null,null,"[nm]",null,null,null,null,null,"mW/m²/nm",null,null,null,null,null,null,null,"[nm]",null,null,null,null,null,"mW/m²/nm",null,null,null,null,null,null,null,"[nm]",null,null,null,null,null,"mW/m²/nm",null,null,null,null,null,null,null,"[nm]",null,null,null,null,null,"mW/m²/nm",null,null,null,null,null,null,null,"[nm]",null,null,null,null,null,"mW/m²/nm"]
[null,null,{"$f":"Data!G1","v":380},null,null,null,null,null,{"$f":"Data!H1","v":2.2667820000000001},null,null,null,null,null,null,null,{"$f":"Data!G13","v":440},null,null,null,null,null,{"$f":"Data!H13","v":7.857132},null,null,null,null,null,null,null,{"$f":"Data!G25","v":500},null,null,null,null,null,{"$f":"Data!H25","v":9.1107759999999995},null,null,null,null,null,null,null,{"$f":"Data!G37","v":560},null,null,null,null,null,{"$f":"Data!H37","v":8.7053999999999991},null,null,null,null,null,null,null,{"$f":"Data!G49","v":620},null,null,null,null,null,{"$f":"Data!H49","v":7.3865400000000001},null,null,null,null,null,null,null,{"$f":"Data!G61","v":680},null,null,null,null,null,{"$f":"Data!H61","v":6.3496920000000001},null,null,null,null,null,null,null,{"$f":"Data!G73","v":740},null,null,null,null,null,{"$f":"Data!H73","v":7.4515640000000003}]
[null,null,{"$f":"Data!G2","v":385},null,null,null,null,null,{"$f":"Data!H2","v":2.4779659999999999},null,null,null,null,null,null,null,{"$f":"Data!G14","v":445},null,null,null,null,null,{"$f":"Data!H14","v":8.4695160000000005},null,null,null,null,null,null,null,{"$f":"Data!G26","v":505},null,null,null,null,null,{"$f":"Data!H26","v":9.1073210000000007},null,null,null,null,null,null,null,{"$f":"Data!G38","v":565},null,null,null,null,null,{"$f":"Data!H38","v":8.4653109999999998},null,null,null,null,null,null,null,{"$f":"Data!G50","v":625},null,null,null,null,null,{"$f":"Data!H50","v":7.2048059999999996},null,null,null,null,null,null,null,{"$f":"Data!G62","v":685},null,null,null,null,null,{"$f":"Data!H62","v":5.9583259999999996},null,null,null,null,null,null,null,{"$f":"Data!G74","v":745},null,null,null,null,null,{"$f":"Data!H74","v":7.6437429999999997}]
[null,null,{"$f":"Data!G3","v":390},null,null,null,null,null,{"$f":"Data!H3","v":2.8305609999999999},null,null,null,null,null,null,null,{"$f":"Data!G15","v":450},null,null,null,null,null,{"$f":"Data!H15","v":9.0620759999999994},null,null,null,null,null,null,null,{"$f":"Data!G27","v":510},null,null,null,null,null,{"$f":"Data!H27","v":9.0491340000000005},null,null,null,null,null,null,null,{"$f":"Data!G39","v":570},null,null,null,null,null,{"$f":"Data!H39","v":8.3170359999999999},null,null,null,null,null,null,null,{"$f":"Data!G51","v":630},null,null,null,null,null,{"$f":"Data!H51","v":7.0726630000000004},null,null,null,null,null,null,null,{"$f":"Data!G63","v":690},null,null,null,null,null,{"$f":"Data!H63","v":5.7667929999999998},null,null,null,null,null,null,null,{"$f":"Data!G75","v":750},null,null,null,null,null,{"$f":"Data!H75","v":7.5227430000000002}]
[null,null,{"$f":"Data!G4","v":395},null,null,null,null,null,{"$f":"Data!H4","v":3.3971849999999999},null,null,null,null,null,null,null,{"$f":"Data!G16","v":455},null,null,null,null,null,{"$f":"Data!H16","v":9.3851980000000008},null,null,null,null,null,null,null,{"$f":"Data!G28","v":515},null,null,null,null,null,{"$f":"Data!H28","v":8.8924649999999996},null,null,null,null,null,null,null,{"$f":"Data!G40","v":575},null,null,null,null,null,{"$f":"Data!H40","v":8.1715920000000004},null,null,null,null,null,null,null,{"$f":"Data!G52","v":635},null,null,null,null,null,{"$f":"Data!H52","v":7.0878990000000002},null,null,null,null,null,null,null,{"$f":"Data!G64","v":695},null,null,null,null,null,{"$f":"Data!H64","v":6.0055940000000003},null,null,null,null,null,null,null,{"$f":"Data!G76","v":755},null,null,null,null,null,{"$f":"Data!H76","v":6.6333419999999998}]
[null,null,{"$f":"Data!G5","v":400},null,null,null,null,null,{"$f":"Data!H5","v":4.636063},null,null,null,null,null,null,null,{"$f":"Data!G17","v":460},null,null,null,null,null,{"$f":"Data!H17","v":9.541563},null,null,null,null,null,null,null,{"$f":"Data!G29","v":520},null,null,null,null,null,{"$f":"Data!H29","v":8.797625},null,null,null,null,null,null,null,{"$f":"Data!G41","v":580},null,null,null,null,null,{"$f":"Data!H41","v":8.1001600000000007},null,null,null,null,null,null,null,{"$f":"Data!G53","v":640},null,null,null,null,null,{"$f":"Data!H53","v":7.0419169999999998},null,null,null,null,null,null,null,{"$f":"Data!G65","v":700},null,null,null,null,null,{"$f":"Data!H65","v":6.2686070000000003},null,null,null,null,null,null,null,{"$f":"Data!G77","v":760},null,null,null,null,null,{"$f":"Data!H77","v":5.164568}]
[null,null,{"$f":"Data!G6","v":405},null,null,null,null,null,{"$f":"Data!H6","v":5.7536860000000001},null,null,null,null,null,null,null,{"$f":"Data!G18","v":465},null,null,null,null,null,{"$f":"Data!H18","v":9.4470469999999995},null,null,null,null,null,null,null,{"$f":"Data!G30","v":525},null,null,null,null,null,{"$f":"Data!H30","v":8.9894829999999999},null,null,null,null,null,null,null,{"$f":"Data!G42","v":585},null,null,null,null,null,{"$f":"Data!H42","v":8.0237320000000008},null,null,null,null,null,null,null,{"$f":"Data!G54","v":645},null,null,null,null,null,{"$f":"Data!H54","v":6.8986169999999998},null,null,null,null,null,null,null,{"$f":"Data!G66","v":705},null,null,null,null,null,{"$f":"Data!H66","v":6.4813590000000003},null,null,null,null,null,null,null,{"$f":"Data!G78","v":765},null,null,null,null,null,{"$f":"Data!H78","v":5.1724899999999998}]
[null,null,{"$f":"Data!G7","v":410},null,null,null,null,null,{"$f":"Data!H7","v":6.132161},null,null,null,null,null,null,null,{"$f":"Data!G19","v":470},null,null,null,null,null,{"$f":"Data!H19","v":9.3762030000000003},null,null,null,null,null,null,null,{"$f":"Data!G31","v":530},null,null,null,null,null,{"$f":"Data!H31","v":9.1116259999999993},null,null,null,null,null,null,null,{"$f":"Data!G43","v":590},null,null,null,null,null,{"$f":"Data!H43","v":7.7804159999999998},null,null,null,null,null,null,null,{"$f":"Data!G55","v":650},null,null,null,null,null,{"$f":"Data!H55","v":6.7647389999999996},null,null,null,null,null,null,null,{"$f":"Data!G67","v":710},null,null,null,null,null,{"$f":"Data!H67","v":6.5850799999999996},null,null,null,null,null,null,null,{"$f":"Data!G79","v":770},null,null,null,null,null,{"$f":"Data!H79","v":6.4865500000000003}]
[null,null,{"$f":"Data!G8","v":415},null,null,null,null,null,{"$f":"Data!H8","v":6.7396719999999997},null,null,null,null,null,null,null,{"$f":"Data!G20","v":475},null,null,null,null,null,{"$f":"Data!H20","v":9.4019049999999993},null,null,null,null,null,null,null,{"$f":"Data!G32","v":535},null,null,null,null,null,{"$f":"Data!H32","v":9.1910430000000005},null,null,null,null,null,null,null,{"$f":"Data!G44","v":595},null,null,null,null,null,{"$f":"Data!H44","v":7.7598640000000003},null,null,null,null,null,null,null,{"$f":"Data!G56","v":655},null,null,null,null,null,{"$f":"Data!H56","v":6.6299609999999998},null,null,null,null,null,null,null,{"$f":"Data!G68","v":715},null,null,null,null,null,{"$f":"Data!H68","v":6.3130559999999996},null,null,null,null,null,null,null,{"$f":"Data!G80","v":775},null,null,null,null,null,{"$f":"Data!H80","v":7.1510049999999996}]
[null,null,{"$f":"Data!G9","v":420},null,null,null,null,null,{"$f":"Data!H9","v":6.9245169999999998},null,null,null,null,null,null,null,{"$f":"Data!G21","v":480},null,null,null,null,null,{"$f":"Data!H21","v":9.3887429999999998},null,null,null,null,null,null,null,{"$f":"Data!G33","v":540},null,null,null,null,null,{"$f":"Data!H33","v":9.068149},null,null,null,null,null,null,null,{"$f":"Data!G45","v":600},null,null,null,null,null,{"$f":"Data!H45","v":7.767684},null,null,null,null,null,null,null,{"$f":"Data!G57","v":660},null,null,null,null,null,{"$f":"Data!H57","v":6.6271659999999999},null,null,null,null,null,null,null,{"$f":"Data!G69","v":720},null,null,null,null,null,{"$f":"Data!H69","v":6.0558719999999999},null,null,null,null,null,null,null,{"$f":"Data!G81","v":780},null,null,null,null,null,{"$f":"Data!H81","v":7.1717950000000004}]
[null,null,{"$f":"Data!G10","v":425},null,null,null,null,null,{"$f":"Data!H10","v":6.8936270000000004},null,null,null,null,null,null,null,{"$f":"Data!G22","v":485},null,null,null,null,null,{"$f":"Data!H22","v":9.1542910000000006},null,null,null,null,null,null,null,{"$f":"Data!G34","v":545},null,null,null,null,null,{"$f":"Data!H34","v":9.0134760000000007},null,null,null,null,null,null,null,{"$f":"Data!G46","v":605},null,null,null,null,null,{"$f":"Data!H46","v":7.731814},null,null,null,null,null,null,null,{"$f":"Data!G58","v":665},null,null,null,null,null,{"$f":"Data!H58","v":6.706842},null,null,null,null,null,null,null,{"$f":"Data!G70","v":725},null,null,null,null,null,{"$f":"Data!H70","v":6.1839829999999996}]
[null,null,{"$f":"Data!G11","v":430},null,null,null,null,null,{"$f":"Data!H11","v":6.7464190000000004},null,null,null,null,null,null,null,{"$f":"Data!G23","v":490},null,null,null,null,null,{"$f":"Data!H23","v":9.0290510000000008},null,null,null,null,null,null,null,{"$f":"Data!G35","v":550},null,null,null,null,null,{"$f":"Data!H35","v":9.0122099999999996},null,null,null,null,null,null,null,{"$f":"Data!G47","v":610},null,null,null,null,null,{"$f":"Data!H47","v":7.6200130000000001},null,null,null,null,null,null,null,{"$f":"Data!G59","v":670},null,null,null,null,null,{"$f":"Data!H59","v":6.6757350000000004},null,null,null,null,null,null,null,{"$f":"Data!G71","v":730},null,null,null,null,null,{"$f":"Data!H71","v":6.6153399999999998}]
[null,null,{"$f":"Data!G12","v":435},null,null,null,null,null,{"$f":"Data!H12","v":7.1653640000000003},null,null,null,null,null,null,null,{"$f":"Data!G24","v":495},null,null,null,null,null,{"$f":"Data!H24","v":9.1911369999999994},null,null,null,null,null,null,null,{"$f":"Data!G36","v":555},null,null,null,null,null,{"$f":"Data!H36","v":8.8750739999999997},null,null,null,null,null,null,null,{"$f":"Data!G48","v":615},null,null,null,null,null,{"$f":"Data!H48","v":7.4500609999999998},null,null,null,null,null,null,null,{"$f":"Data!G60","v":675},null,null,null,null,null,{"$f":"Data!H60","v":6.5624269999999996},null,null,null,null,null,null,null,{"$f":"Data!G72","v":735},null,null,null,null,null,{"$f":"Data!H72","v":7.1217439999999996}]
[]
[{"$f":"IF(Data!$AE$2=\"DE\",\"Firma\",IF(Data!$AE$2=\"UK\",\"Company\",IF(Data!$AE$2=\"FR\",\"Société\",\"Language Error\")))","v":"Company"}]
[{"$f":"IF(Data!$AE$2=\"DE\",\"Adresse\",IF(Data!$AE$2=\"UK\",\"Address\",IF(Data!$AE$2=\"FR\",\"Adresse\",\"Language Error\")))","v":"Address"}]
[{"$f":"IF(Data!$AE$2=\"DE\",\"PLZ  Ort\",IF(Data!$AE$2=\"UK\",\"ZIP  City\",IF(Data!$AE$2=\"FR\",\"Code postal Ville\",\"Language Error\")))","v":"ZIP  City"}]
[]
[{"$f":"IF(Data!$AE$2=\"DE\",\"Prüfort,\",IF(Data!$AE$2=\"UK\",\"Test location,\",IF(Data!$AE$2=\"FR\",\"Lieu de rapport, \",\"Language Error\")))","v":"Test location,"},null,null,null,null,null,null,null,null,null,null,null,null,null,null,{"$f":"IF(Data!$AE$2=\"DE\",\"Datum\",IF(Data!$AE$2=\"UK\",\"Date\",IF(Data!$AE$2=\"FR\",\"Date\",\"Language Error\")))","v":"Date"},null,null,null,null,null,null,null,null,null,null,null,null,null,null,null,null,null,null,null,null,null,null,null,null,null,null,null,null,null,null,null,null,null,null,null,null,null,null,null,null,null,null,null,null,null,null,null,{"$f":"IF(Data!$AE$2=\"DE\",\"Vorname, Nachname Prüfer\",IF(Data!$AE$2=\"UK\",\"First, last name of inspector\",IF(Data!$AE$2=\"FR\",\"Prénom Nom du testeur\",\"Language Error\")))","v":"First, last name of inspector"},null,null,null,null,null,null,null,null,null,null,null,null,null,null,null,null,null,null,null,null,{"$f":"IF(Data!$AE$2=\"DE\",\"Telefonnummer\",IF(Data!$AE$2=\"UK\",\"Phone number\",IF(Data!$AE$2=\"FR\",\"N° téléphone\",\"Language Error\")))","v":"Phone number"}]

{"sheet":"Protocol 2 (native)","index":1,"n_rows":68,"n_cols":91,"rows_kept":68,"cut":false,"hidden":false,"merged":[[63,0,63,26],[64,0,64,26],[65,0,65,26],[67,0,67,14],[67,15,67,26],[3,62,3,83],[3,84,3,99],[4,62,4,83],[4,84,4,99],[5,62,5,83],[3,0,3,12],[3,13,3,58],[4,13,4,58],[5,13,5,58],[52,71,52,75],[52,76,52,84],[47,71,47,75],[47,76,47,84],[48,71,48,75],[48,76,48,84],[36,71,36,75],[36,76,36,84],[37,71,37,75],[37,76,37,84],[45,161,45,164],[67,63,67,83],[67,84,67,101],[0,0,1,53],[39,161,39,164],[39,165,39,170],[40,161,40,164],[40,165,40,170],[41,161,41,164],[41,165,41,170],[30,151,30,154],[30,155,30,160],[31,151,31,154],[31,155,31,160],[27,155,27,160],[28,155,28,160],[36,161,36,164],[37,161,37,164],[22,141,22,144],[32,151,32,154],[33,151,33,154],[34,151,34,154],[35,151,35,154],[22,131,22,134],[28,131,28,134],[53,131,53,134],[23,141,23,144],[24,141,24,144],[25,141,25,144],[26,141,26,144],[27,141,27,144],[28,141,28,144],[29,141,29,144],[30,141,30,144],[31,141,31,144],[32,141,32,144],[25,135,25,140],[26,135,26,140],[27,135,27,140],[51,131,51,134],[51,135,51,140],[52,131,52,134],[52,135,52,140],[47,141,47,144],[48,141,48,144],[37,141,37,144],[44,141,44,144],[45,141,45,144],[26,151,26,154],[27,151,27,154],[28,151,28,154],[28,135,28,140],[36,151,36,154],[51,71,51,75],[51,76,51,84],[49,71,49,75],[49,76,49,84],[50,71,50,75],[50,76,50,84],[41,71,41,75],[41,76,41,84],[42,71,42,75],[42,76,42,84],[43,71,43,75],[43,76,43,84],[44,71,44,75],[44,76,44,84],[45,71,45,75],[45,76,45,84],[43,121,43,124],[43,125,43,130],[44,121,44,124],[22,111,22,114],[33,111,33,114],[34,111,34,114],[35,111,35,114],[36,111,36,114],[37,111,37,114],[38,111,38,114],[39,111,39,114],[26,145,26,150],[27,145,27,150],[28,145,28,150],[22,121,22,124],[22,125,22,130],[23,135,23,140],[24,135,24,140],[38,135,38,140],[39,135,39,140],[31,135,31,140],[32,135,32,140],[33,135,33,140],[29,135,29,140],[30,135,30,140],[26,131,26,134],[27,131,27,134],[35,71,35,75],[35,76,35,84],[40,111,40,114],[41,111,41,114],[42,111,42,114],[43,111,43,114],[44,111,44,114],[45,111,45,114],[46,111,46,114],[46,71,46,75],[46,76,46,84],[43,85,43,89],[43,90,43,98],[44,85,44,89],[44,90,44,98],[45,85,45,89],[45,90,45,98],[38,90,38,98],[39,85,39,89],[39,90,39,98],[40,85,40,89],[40,90,40,98],[45,57,45,61],[46,57,46,61],[47,57,47,61],[48,57,48,61],[49,57,49,61],[52,57,52,61],[36,57,36,61],[36,62,36,70],[37,57,37,61],[37,62,37,70],[38,57,38,61],[38,62,38,70],[39,57,39,61],[39,62,39,70],[45,62,45,70],[46,62,46,70],[47,62,47,70],[48,62,48,70],[49,62,49,70],[50,57,50,61],[50,62,50,70],[51,57,51,61],[51,62,51,70],[52,62,52,70],[26,155,26,160],[32,57,32,61],[32,62,32,70],[33,57,33,61],[33,62,33,70],[34,57,34,61],[34,62,34,70],[35,57,35,61],[35,62,35,70],[31,57,31,61],[31,62,31,70],[26,71,26,75],[26,76,26,84],[27,71,27,75],[27,76,27,84],[28,71,28,75],[28,76,28,84],[29,71,29,75],[29,76,29,84],[30,71,30,75],[30,76,30,84],[31,71,31,75],[31,76,31,84],[32,71,32,75],[46,161,46,164],[23,165,23,170],[24,165,24,170],[25,165,25,170],[51,155,51,160],[52,155,52,160],[53,155,53,160],[32,165,32,170],[29,165,29,170],[30,165,30,170],[31,165,31,170],[26,165,26,170],[27,165,27,170],[28,165,28,170],[36,165,36,170],[37,165,37,170],[38,165,38,170],[33,165,33,170],[34,165,34,170],[35,165,35,170],[46,165,46,170],[43,165,43,170],[44,165,44,170],[45,165,45,170],[34,161,34,164],[35,161,35,164],[32,161,32,164],[35,155,35,160],[43,161,43,164],[44,161,44,164],[42,155,42,160],[43,155,43,160],[44,155,44,160],[39,155,39,160],[23,161,23,164],[24,161,24,164],[25,161,25,164],[41,145,41,150],[42,145,42,150],[43,145,43,150],[26,161,26,164],[27,161,27,164],[28,161,28,164],[23,155,23,160],[24,155,24,160],[25,155,25,160],[23,151,23,154],[24,151,24,154],[25,151,25,154],[25,145,25,150],[29,145,29,150],[30,145,30,150],[31,145,31,150],[29,161,29,164],[30,161,30,164],[31,161,31,164],[38,161,38,164],[33,161,33,164],[32,145,32,150],[33,145,33,150],[34,145,34,150],[38,145,38,150],[39,145,39,150],[40,145,40,150],[35,145,35,150],[36,145,36,150],[37,145,37,150],[38,15,38,19],[38,20,38,28],[31,34,31,42],[32,29,32,33],[33,141,33,144],[34,141,34,144],[36,135,36,140],[41,141,41,144],[42,141,42,144],[42,135,42,140],[37,135,37,140],[34,135,34,140],[35,135,35,140],[38,71,38,75],[38,76,38,84],[39,71,39,75],[39,76,39,84],[40,71,40,75],[40,76,40,84],[32,76,32,84],[33,71,33,75],[33,76,33,84],[34,71,34,75],[34,76,34,84],[33,20,33,28],[34,15,34,19],[34,20,34,28],[35,15,35,19],[35,20,35,28],[36,15,36,19],[36,20,36,28],[37,15,37,19],[37,20,37,28],[23,131,23,134],[24,131,24,134],[25,131,25,134],[51,121,51,124],[52,121,52,124],[53,121,53,124],[29,131,29,134],[30,131,30,134],[31,131,31,134],[48,131,48,134],[49,131,49,134],[50,131,50,134],[45,131,45,134],[46,131,46,134],[47,131,47,134],[43,131,43,134],[44,131,44,134],[42,131,42,134],[38,131,38,134],[39,131,39,134],[40,131,40,134],[23,125,23,130],[50,125,50,130],[51,125,51,130],[53,111,53,114],[23,121,23,124],[49,111,49,114],[50,111,50,114],[51,111,51,114],[24,121,24,124],[35,121,35,124],[36,121,36,124],[23,115,23,120],[33,121,33,124],[30,121,30,124],[31,121,31,124],[32,121,32,124],[23,111,23,114],[31,111,31,114],[32,111,32,114],[32,115,32,120],[45,121,45,124],[37,115,37,120],[49,121,49,124],[50,121,50,124],[41,115,41,120],[40,115,40,120],[39,115,39,120],[52,125,52,130],[53,125,53,130],[41,121,41,124],[42,121,42,124],[47,121,47,124],[28,125,28,130],[27,125,27,130],[26,125,26,130],[24,111,24,114],[25,111,25,114],[26,111,26,114],[27,111,27,114],[28,111,28,114],[27,121,27,124],[28,121,28,124],[24,125,24,130],[53,115,53,120],[52,115,52,120],[51,115,51,120],[50,115,50,120],[49,115,49,120],[47,111,47,114],[48,111,48,114],[52,111,52,114],[29,151,29,154],[29,155,29,160],[40,125,40,130],[30,111,30,114],[40,121,40,124],[39,125,39,130],[29,111,29,114],[38,125,38,130],[37,125,37,130],[36,125,36,130],[35,125,35,130],[34,125,34,130],[32,125,32,130],[31,125,31,130],[30,125,30,130],[29,125,29,130],[35,131,35,134],[36,131,36,134],[37,131,37,134],[32,131,32,134],[33,131,33,134],[34,131,34,134],[35,141,35,144],[36,141,36,144],[53,141,53,144],[50,141,50,144],[51,141,51,144],[52,141,52,144],[50,145,50,150],[51,145,51,150],[52,145,52,150],[49,141,49,144],[51,151,51,154],[52,151,52,154],[53,151,53,154],[53,145,53,150],[49,145,49,150],[49,125,49,130],[49,135,49,140],[46,121,46,124],[46,125,46,130],[46,135,46,140],[48,151,48,154],[49,151,49,154],[50,151,50,154],[43,141,43,144],[37,151,37,154],[40,151,40,154],[41,151,41,154],[45,155,45,160],[46,155,46,160],[40,155,40,160],[41,155,41,160],[38,151,38,154],[50,135,50,140],[47,135,47,140],[38,141,38,144],[39,141,39,144],[40,141,40,144],[47,151,47,154],[44,145,44,150],[45,145,45,150],[46,145,46,150],[47,145,47,150],[48,145,48,150],[38,115,38,120],[48,155,48,160],[49,155,49,160],[50,155,50,160],[47,155,47,160],[42,151,42,154],[39,151,39,154],[44,125,44,130],[45,125,45,130],[40,135,40,140],[41,135,41,140],[44,135,44,140],[45,135,45,140],[46,141,46,144],[43,135,43,140],[41,131,41,134],[47,125,47,130],[48,121,48,124],[48,125,48,130],[41,125,41,130],[43,151,43,154],[44,151,44,154],[45,151,45,154],[46,151,46,154],[22,161,22,164],[22,165,22,170],[22,135,22,140],[22,145,22,150],[22,151,22,154],[36,115,36,120],[42,115,42,120],[48,115,48,120],[42,125,42,130],[33,125,33,130],[25,125,25,130],[30,115,30,120],[31,115,31,120],[35,115,35,120],[34,115,34,120],[36,155,36,160],[37,155,37,160],[38,155,38,160],[47,115,47,120],[46,115,46,120],[45,115,45,120],[44,115,44,120],[43,115,43,120],[48,135,48,140],[53,135,53,140],[32,155,32,160],[42,161,42,164],[42,165,42,170],[33,115,33,120],[22,115,22,120],[22,155,22,160],[29,121,29,124],[25,121,25,124],[26,121,26,124],[27,115,27,120],[28,115,28,120],[29,115,29,120],[37,121,37,124],[38,121,38,124],[39,121,39,124],[24,115,24,120],[25,115,25,120],[26,115,26,120],[34,121,34,124],[33,155,33,160],[34,155,34,160],[23,145,23,150],[24,145,24,150],[39,1,39,5],[40,1,40,5],[41,1,41,5],[42,1,42,5],[44,6,44,14],[45,6,45,14],[46,6,46,14],[30,1,30,5],[31,1,31,5],[32,1,32,5],[33,1,33,5],[34,1,34,5],[35,1,35,5],[36,1,36,5],[37,1,37,5],[38,1,38,5],[43,1,43,5],[44,1,44,5],[45,1,45,5],[46,1,46,5],[47,6,47,14],[48,6,48,14],[49,6,49,14],[50,6,50,14],[51,6,51,14],[52,6,52,14],[27,15,27,19],[27,20,27,28],[28,15,28,19],[28,20,28,28],[29,15,29,19],[29,20,29,28],[39,6,39,14],[40,6,40,14],[41,6,41,14],[42,6,42,14],[43,6,43,14],[48,20,48,28],[39,15,39,19],[39,20,39,28],[40,15,40,19],[40,20,40,28],[41,15,41,19],[41,20,41,28],[22,1,22,5],[21,1,21,5],[23,1,23,5],[24,1,24,5],[25,1,25,5],[26,1,26,5],[27,1,27,5],[28,1,28,5],[29,1,29,5],[47,1,47,5],[48,1,48,5],[49,1,49,5],[50,1,50,5],[51,1,51,5],[52,1,52,5],[21,6,21,14],[22,6,22,14],[23,6,23,14],[24,6,24,14],[25,6,25,14],[26,6,26,14],[27,6,27,14],[28,6,28,14],[29,6,29,14],[30,6,30,14],[31,6,31,14],[32,6,32,14],[33,6,33,14],[34,6,34,14],[35,6,35,14],[36,6,36,14],[37,6,37,14],[38,6,38,14],[51,20,51,28],[52,15,52,19],[52,20,52,28],[21,15,21,19],[21,20,21,28],[22,15,22,19],[22,20,22,28],[23,15,23,19],[23,20,23,28],[24,15,24,19],[24,20,24,28],[25,15,25,19],[25,20,25,28],[26,15,26,19],[26,20,26,28],[42,15,42,19],[42,20,42,28],[30,15,30,19],[30,20,30,28],[31,15,31,19],[31,20,31,28],[32,15,32,19],[32,20,32,28],[33,15,33,19],[31,29,31,33],[36,29,36,33],[41,29,41,33],[46,29,46,33],[51,29,51,33],[44,15,44,19],[44,20,44,28],[45,15,45,19],[45,20,45,28],[46,15,46,19],[46,20,46,28],[47,15,47,19],[47,20,47,28],[48,15,48,19],[38,29,38,33],[44,29,44,33],[50,29,50,33],[43,15,43,19],[43,20,43,28],[49,15,49,19],[49,20,49,28],[50,15,50,19],[50,20,50,28],[51,15,51,19],[21,34,21,42],[22,29,22,33],[22,34,22,42],[23,29,23,33],[23,34,23,42],[24,29,24,33],[24,34,24,42],[25,29,25,33],[25,34,25,42],[21,29,21,33],[26,34,26,42],[27,29,27,33],[27,34,27,42],[28,29,28,33],[28,34,28,42],[29,29,29,33],[29,34,29,42],[30,29,30,33],[30,34,30,42],[26,29,26,33],[32,34,32,42],[33,29,33,33],[33,34,33,42],[34,29,34,33],[34,34,34,42],[35,29,35,33],[35,34,35,42],[36,34,36,42],[37,29,37,33],[37,34,37,42],[38,34,38,42],[39,29,39,33],[39,34,39,42],[40,29,40,33],[40,34,40,42],[41,34,41,42],[42,29,42,33],[42,34,42,42],[43,29,43,33],[43,34,43,42],[44,34,44,42],[45,29,45,33],[45,34,45,42],[46,34,46,42],[47,29,47,33],[47,34,47,42],[48,29,48,33],[48,34,48,42],[49,29,49,33],[49,34,49,42],[50,34,50,42],[51,34,51,42],[52,29,52,33],[52,34,52,42],[21,43,21,47],[21,48,21,56],[22,43,22,47],[22,48,22,56],[23,43,23,47],[23,48,23,56],[24,43,24,47],[24,48,24,56],[25,43,25,47],[25,48,25,56],[26,43,26,47],[26,48,26,56],[27,43,27,47],[27,48,27,56],[28,43,28,47],[28,48,28,56],[29,43,29,47],[29,48,29,56],[30,43,30,47],[30,48,30,56],[31,43,31,47],[32,43,32,47],[32,48,32,56],[33,43,33,47],[33,48,33,56],[34,43,34,47],[34,48,34,56],[35,43,35,47],[35,48,35,56],[31,48,31,56],[36,43,36,47],[36,48,36,56],[37,43,37,47],[37,48,37,56],[38,43,38,47],[38,48,38,56],[39,43,39,47],[39,48,39,56],[40,43,40,47],[40,48,40,56],[41,43,41,47],[41,48,41,56],[42,43,42,47],[42,48,42,56],[43,43,43,47],[43,48,43,56],[44,43,44,47],[44,48,44,56],[45,43,45,47],[45,48,45,56],[46,43,46,47],[46,48,46,56],[47,43,47,47],[47,48,47,56],[48,43,48,47],[48,48,48,56],[49,43,49,47],[49,48,49,56],[50,43,50,47],[50,48,50,56],[51,43,51,47],[51,48,51,56],[52,43,52,47],[52,48,52,56],[21,57,21,61],[21,62,21,70],[22,57,22,61],[22,62,22,70],[23,57,23,61],[23,62,23,70],[24,57,24,61],[24,62,24,70],[25,57,25,61],[25,62,25,70],[26,57,26,61],[26,62,26,70],[27,57,27,61],[27,62,27,70],[28,57,28,61],[28,62,28,70],[29,57,29,61],[29,62,29,70],[30,57,30,61],[30,62,30,70],[40,57,40,61],[40,62,40,70],[41,57,41,61],[41,62,41,70],[42,57,42,61],[42,62,42,70],[43,57,43,61],[43,62,43,70],[44,57,44,61],[44,62,44,70],[21,71,21,75],[21,76,21,84],[22,71,22,75],[22,76,22,84],[23,71,23,75],[23,76,23,84],[24,71,24,75],[24,76,24,84],[25,71,25,75],[25,76,25,84],[21,85,21,89],[21,90,21,98],[22,85,22,89],[22,90,22,98],[23,85,23,89],[23,90,23,98],[24,85,24,89],[24,90,24,98],[25,85,25,89],[25,90,25,98],[26,85,26,89],[26,90,26,98],[27,85,27,89],[27,90,27,98],[28,85,28,89],[28,90,28,98],[29,85,29,89],[29,90,29,98],[30,85,30,89],[30,90,30,98],[31,85,31,89],[31,90,31,98],[32,85,32,89],[32,90,32,98],[33,85,33,89],[33,90,33,98],[34,85,34,89],[34,90,34,98],[35,85,35,89],[35,90,35,98],[5,84,5,99],[51,85,51,89],[51,90,51,98],[52,85,52,89],[52,90,52,98],[46,85,46,89],[46,90,46,98],[47,85,47,89],[47,90,47,98],[48,85,48,89],[48,90,48,98],[49,85,49,89],[49,90,49,98],[50,85,50,89],[50,90,50,98],[41,85,41,89],[41,90,41,98],[42,85,42,89],[42,90,42,98],[36,85,36,89],[36,90,36,98],[37,85,37,89],[37,90,37,98],[38,85,38,89]]}
[{"$f":"IF(Data!$AE$2=\"DE\",\"Messprotokoll\",IF(Data!$AE$2=\"UK\",\"Measurement protocol\",IF(Data!$AE$2=\"FR\",\"Rapport de mesure\",\"Language Error\")))","v":"Measurement protocol"}]
[]
[]
[{"$f":"IF(Data!$AE$2 = \"DE\", \"Prüfling:\", IF(Data!$AE$2 = \"UK\",\"Test object:\",IF(Data!$AE$2=\"FR\",\"Objet testé:\",\"Language Error\")))","v":"Test object:"},null,null,null,null,null,null,null,null,null,null,null,null,{"$f":"'Protocol 1 (5nm)'!N4:BG4","v":"Manufacturer"},null,null,null,null,null,null,null,null,null,null,null,null,null,null,null,null,null,null,null,null,null,null,null,null,null,null,null,null,null,null,null,null,null,null,null,null,null,null,null,null,null,null,null,null,null,null,null,null,{"$f":"IF(Data!$AE$2=\"DE\",\"Messdatei:\",IF(Data!$AE$2=\"UK\",\"Measurement file:\",IF(Data!$AE$2=\"FR\",\"Fichier de mesure:\",\"Language Error\")))","v":"Measurement file:"},null,null,null,null,null,null,null,null,null,null,null,null,null,null,null,null,null,null,null,null,null,{"$f":"Data!Q18","v":"Measured"}]
[null,null,null,null,null,null,null,null,null,null,null,null,null,{"$f":"'Protocol 1 (5nm)'!N5:BG5","v":"Type"},null,null,null,null,null,null,null,null,null,null,null,null,null,null,null,null,null,null,null,null,null,null,null,null,null,null,null,null,null,null,null,null,null,null,null,null,null,null,null,null,null,null,null,null,null,null,null,null,{"$f":"IF(Data!$AE$2=\"DE\",\"Datum der Messung:\",IF(Data!$AE$2=\"UK\",\"Date of measurement:\",IF(Data!$AE$2=\"FR\",\"Date de mesure:\",\"Language Error\")))","v":"Date of measurement:"},null,null,null,null,null,null,null,null,null,null,null,null,null,null,null,null,null,null,null,null,null,{"$f":"Data!Q23","v":"22.04.2024"}]
[null,null,null,null,null,null,null,null,null,null,null,null,null,{"$f":"'Protocol 1 (5nm)'!N6:BG6","v":"Model"},null,null,null,null,null,null,null,null,null,null,null,null,null,null,null,null,null,null,null,null,null,null,null,null,null,null,null,null,null,null,null,null,null,null,null,null,null,null,null,null,null,null,null,null,null,null,null,null,{"$f":"IF(Data!$AE$2=\"DE\",\"Uhrzeit der Messung:\",IF(Data!$AE$2=\"UK\",\"Time of measurement:\",IF(Data!$AE$2=\"FR\",\"Heure de mesure:\",\"Language Error\")))","v":"Time of measurement:"},null,null,null,null,null,null,null,null,null,null,null,null,null,null,null,null,null,null,null,null,null,{"$f":"Data!Q21","v":"14:26:00"}]
[]
[]
[]
[]
[]
[]
[]
[]
[]
[]
[]
[]
[]
[]
[]
[null,"[nm]",null,null,null,null,"mW/m²/nm",null,null,null,null,null,null,null,null,"[nm]",null,null,null,null,"mW/m²/nm",null,null,null,null,null,null,null,null,"[nm]",null,null,null,null,"mW/m²/nm",null,null,null,null,null,null,null,null,"[nm]",null,null,null,null,"mW/m²/nm",null,null,null,null,null,null,null,null,"[nm]",null,null,null,null,"mW/m²/nm",null,null,null,null,null,null,null,null,"[nm]",null,null,null,null,"mW/m²/nm",null,null,null,null,null,null,null,null,"[nm]",null,null,null,null,"mW/m²/nm"]
[null,{"$f":"Data!$G1","v":380},null,null,null,null,{"$f":"Data!$H1","v":2.2667820000000001},null,null,null,null,null,null,null,null,{"$f":"Data!$G32","v":535},null,null,null,null,{"$f":"Data!$H32","v":9.1910430000000005},null,null,null,null,null,null,null,null,{"$f":"IF(Data!$G63=\"\",\"\",Data!$G63)","v":690},null,null,null,null,{"$f":"IF(Data!$H63=\"\",\"\",Data!$H63)","v":5.7667929999999998},null,null,null,null,null,null,null,null,{"$f":"IF(Data!$G94=\"\",\"\",Data!$G94)","v":""},null,null,null,null,{"$f":"IF(Data!$H94=\"\",\"\",Data!$H94)","v":""},null,null,null,null,null,null,null,null,{"$f":"IF(Data!$G125=\"\",\"\",Data!$G125)","v":""},null,null,null,null,{"$f":"IF(Data!$H125=\"\",\"\",Data!$H125)","v":""},null,null,null,null,null,null,null,null,{"$f":"IF(Data!$G156=\"\",\"\",Data!$G156)","v":""},null,null,null,null,{"$f":"IF(Data!$H156=\"\",\"\",Data!$H156)","v":""},null,null,null,null,null,null,null,null,{"$f":"IF(Data!$G187=\"\",\"\",Data!$G187)","v":""},null,null,null,null,{"$f":"IF(Data!$H187=\"\",\"\",Data!$H187)","v":""}]
[null,{"$f":"Data!$G2","v":385},null,null,null,null,{"$f":"Data!$H2","v":2.4779659999999999},null,null,null,null,null,null,null,null,{"$f":"Data!$G33","v":540},null,null,null,null,{"$f":"Data!$H33","v":9.068149},null,null,null,null,null,null,null,null,{"$f":"IF(Data!$G64=\"\",\"\",Data!$G64)","v":695},null,null,null,null,{"$f":"IF(Data!$H64=\"\",\"\",Data!$H64)","v":6.0055940000000003},null,null,null,null,null,null,null,null,{"$f":"IF(Data!$G95=\"\",\"\",Data!$G95)","v":""},null,null,null,null,{"$f":"IF(Data!$H95=\"\",\"\",Data!$H95)","v":""},null,null,null,null,null,null,null,null,{"$f":"IF(Data!$G126=\"\",\"\",Data!$G126)","v":""},null,null,null,null,{"$f":"IF(Data!$H126=\"\",\"\",Data!$H126)","v":""},null,null,null,null,null,null,null,null,{"$f":"IF(Data!$G157=\"\",\"\",Data!$G157)","v":""},null,null,null,null,{"$f":"IF(Data!$H157=\"\",\"\",Data!$H157)","v":""},null,null,null,null,null,null,null,null,{"$f":"IF(Data!$G188=\"\",\"\",Data!$G188)","v":""},null,null,null,null,{"$f":"IF(Data!$H188=\"\",\"\",Data!$H188)","v":""}]
[null,{"$f":"Data!$G3","v":390},null,null,null,null,{"$f":"Data!$H3","v":2.8305609999999999},null,null,null,null,null,null,null,null,{"$f":"Data!$G34","v":545},null,null,null,null,{"$f":"Data!$H34","v":9.0134760000000007},null,null,null,null,null,null,null,null,{"$f":"IF(Data!$G65=\"\",\"\",Data!$G65)","v":700},null,null,null,null,{"$f":"IF(Data!$H65=\"\",\"\",Data!$H65)","v":6.2686070000000003},null,null,null,null,null,null,null,null,{"$f":"IF(Data!$G96=\"\",\"\",Data!$G96)","v":""},null,null,null,null,{"$f":"IF(Data!$H96=\"\",\"\",Data!$H96)","v":""},null,null,null,null,null,null,null,null,{"$f":"IF(Data!$G127=\"\",\"\",Data!$G127)","v":""},null,null,null,null,{"$f":"IF(Data!$H127=\"\",\"\",Data!$H127)","v":""},null,null,null,null,null,null,null,null,{"$f":"IF(Data!$G158=\"\",\"\",Data!$G158)","v":""},null,null,null,null,{"$f":"IF(Data!$H158=\"\",\"\",Data!$H158)","v":""},null,null,null,null,null,null,null,null,{"$f":"IF(Data!$G189=\"\",\"\",Data!$G189)","v":""},null,null,null,null,{"$f":"IF(Data!$H189=\"\",\"\",Data!$H189)","v":""}]
[null,{"$f":"Data!$G4","v":395},null,null,null,null,{"$f":"Data!$H4","v":3.3971849999999999},null,null,null,null,null,null,null,null,{"$f":"Data!$G35","v":550},null,null,null,null,{"$f":"Data!$H35","v":9.0122099999999996},null,null,null,null,null,null,null,null,{"$f":"IF(Data!$G66=\"\",\"\",Data!$G66)","v":705},null,null,null,null,{"$f":"IF(Data!$H66=\"\",\"\",Data!$H66)","v":6.4813590000000003},null,null,null,null,null,null,null,null,{"$f":"IF(Data!$G97=\"\",\"\",Data!$G97)","v":""},null,null,null,null,{"$f":"IF(Data!$H97=\"\",\"\",Data!$H97)","v":""},null,null,null,null,null,null,null,null,{"$f":"IF(Data!$G128=\"\",\"\",Data!$G128)","v":""},null,null,null,null,{"$f":"IF(Data!$H128=\"\",\"\",Data!$H128)","v":""},null,null,null,null,null,null,null,null,{"$f":"IF(Data!$G159=\"\",\"\",Data!$G159)","v":""},null,null,null,null,{"$f":"IF(Data!$H159=\"\",\"\",Data!$H159)","v":""},null,null,null,null,null,null,null,null,{"$f":"IF(Data!$G190=\"\",\"\",Data!$G190)","v":""},null,null,null,null,{"$f":"IF(Data!$H190=\"\",\"\",Data!$H190)","v":""}]
[null,{"$f":"Data!$G5","v":400},null,null,null,null,{"$f":"Data!$H5","v":4.636063},null,null,null,null,null,null,null,null,{"$f":"Data!$G36","v":555},null,null,null,null,{"$f":"Data!$H36","v":8.8750739999999997},null,null,null,null,null,null,null,null,{"$f":"IF(Data!$G67=\"\",\"\",Data!$G67)","v":710},null,null,null,null,{"$f":"IF(Data!$H67=\"\",\"\",Data!$H67)","v":6.5850799999999996},null,null,null,null,null,null,null,null,{"$f":"IF(Data!$G98=\"\",\"\",Data!$G98)","v":""},null,null,null,null,{"$f":"IF(Data!$H98=\"\",\"\",Data!$H98)","v":""},null,null,null,null,null,null,null,null,{"$f":"IF(Data!$G129=\"\",\"\",Data!$G129)","v":""},null,null,null,null,{"$f":"IF(Data!$H129=\"\",\"\",Data!$H129)","v":""},null,null,null,null,null,null,null,null,{"$f":"IF(Data!$G160=\"\",\"\",Data!$G160)","v":""},null,null,null,null,{"$f":"IF(Data!$H160=\"\",\"\",Data!$H160)","v":""},null,null,null,null,null,null,null,null,{"$f":"IF(Data!$G191=\"\",\"\",Data!$G191)","v":""},null,null,null,null,{"$f":"IF(Data!$H191=\"\",\"\",Data!$H191)","v":""}]
[null,{"$f":"Data!$G6","v":405},null,null,null,null,{"$f":"Data!$H6","v":5.7536860000000001},null,null,null,null,null,null,null,null,{"$f":"Data!$G37","v":560},null,null,null,null,{"$f":"Data!$H37","v":8.7053999999999991},null,null,null,null,null,null,null,null,{"$f":"IF(Data!$G68=\"\",\"\",Data!$G68)","v":715},null,null,null,null,{"$f":"IF(Data!$H68=\"\",\"\",Data!$H68)","v":6.3130559999999996},null,null,null,null,null,null,null,null,{"$f":"IF(Data!$G99=\"\",\"\",Data!$G99)","v":""},null,null,null,null,{"$f":"IF(Data!$H99=\"\",\"\",Data!$H99)","v":""},null,null,null,null,null,null,null,null,{"$f":"IF(Data!$G130=\"\",\"\",Data!$G130)","v":""},null,null,null,null,{"$f":"IF(Data!$H130=\"\",\"\",Data!$H130)","v":""},null,null,null,null,null,null,null,null,{"$f":"IF(Data!$G161=\"\",\"\",Data!$G161)","v":""},null,null,null,null,{"$f":"IF(Data!$H161=\"\",\"\",Data!$H161)","v":""},null,null,null,null,null,null,null,null,{"$f":"IF(Data!$G192=\"\",\"\",Data!$G192)","v":""},null,null,null,null,{"$f":"IF(Data!$H192=\"\",\"\",Data!$H192)","v":""}]
[null,{"$f":"Data!$G7","v":410},null,null,null,null,{"$f":"Data!$H7","v":6.132161},null,null,null,null,null,null,null,null,{"$f":"Data!$G38","v":565},null,null,null,null,{"$f":"Data!$H38","v":8.4653109999999998},null,null,null,null,null,null,null,null,{"$f":"IF(Data!$G69=\"\",\"\",Data!$G69)","v":720},null,null,null,null,{"$f":"IF(Data!$H69=\"\",\"\",Data!$H69)","v":6.0558719999999999},null,null,null,null,null,null,null,null,{"$f":"IF(Data!$G100=\"\",\"\",Data!$G100)","v":""},null,null,null,null,{"$f":"IF(Data!$H100=\"\",\"\",Data!$H100)","v":""},null,null,null,null,null,null,null,null,{"$f":"IF(Data!$G131=\"\",\"\",Data!$G131)","v":""},null,null,null,null,{"$f":"IF(Data!$H131=\"\",\"\",Data!$H131)","v":""},null,null,null,null,null,null,null,null,{"$f":"IF(Data!$G162=\"\",\"\",Data!$G162)","v":""},null,null,null,null,{"$f":"IF(Data!$H162=\"\",\"\",Data!$H162)","v":""},null,null,null,null,null,null,null,null,{"$f":"IF(Data!$G193=\"\",\"\",Data!$G193)","v":""},null,null,null,null,{"$f":"IF(Data!$H193=\"\",\"\",Data!$H193)","v":""}]
[null,{"$f":"Data!$G8","v":415},null,null,null,null,{"$f":"Data!$H8","v":6.7396719999999997},null,null,null,null,null,null,null,null,{"$f":"Data!$G39","v":570},null,null,null,null,{"$f":"Data!$H39","v":8.3170359999999999},null,null,null,null,null,null,null,null,{"$f":"IF(Data!$G70=\"\",\"\",Data!$G70)","v":725},null,null,null,null,{"$f":"IF(Data!$H70=\"\",\"\",Data!$H70)","v":6.1839829999999996},null,null,null,null,null,null,null,null,{"$f":"IF(Data!$G101=\"\",\"\",Data!$G101)","v":""},null,null,null,null,{"$f":"IF(Data!$H101=\"\",\"\",Data!$H101)","v":""},null,null,null,null,null,null,null,null,{"$f":"IF(Data!$G132=\"\",\"\",Data!$G132)","v":""},null,null,null,null,{"$f":"IF(Data!$H132=\"\",\"\",Data!$H132)","v":""},null,null,null,null,null,null,null,null,{"$f":"IF(Data!$G163=\"\",\"\",Data!$G163)","v":""},null,null,null,null,{"$f":"IF(Data!$H163=\"\",\"\",Data!$H163)","v":""},null,null,null,null,null,null,null,null,{"$f":"IF(Data!$G194=\"\",\"\",Data!$G194)","v":""},null,null,null,null,{"$f":"IF(Data!$H194=\"\",\"\",Data!$H194)","v":""}]
[null,{"$f":"Data!$G9","v":420},null,null,null,null,{"$f":"Data!$H9","v":6.9245169999999998},null,null,null,null,null,null,null,null,{"$f":"Data!$G40","v":575},null,null,null,null,{"$f":"Data!$H40","v":8.1715920000000004},null,null,null,null,null,null,null,null,{"$f":"IF(Data!$G71=\"\",\"\",Data!$G71)","v":730},null,null,null,null,{"$f":"IF(Data!$H71=\"\",\"\",Data!$H71)","v":6.6153399999999998},null,null,null,null,null,null,null,null,{"$f":"IF(Data!$G102=\"\",\"\",Data!$G102)","v":""},null,null,null,null,{"$f":"IF(Data!$H102=\"\",\"\",Data!$H102)","v":""},null,null,null,null,null,null,null,null,{"$f":"IF(Data!$G133=\"\",\"\",Data!$G133)","v":""},null,null,null,null,{"$f":"IF(Data!$H133=\"\",\"\",Data!$H133)","v":""},null,null,null,null,null,null,null,null,{"$f":"IF(Data!$G164=\"\",\"\",Data!$G164)","v":""},null,null,null,null,{"$f":"IF(Data!$H164=\"\",\"\",Data!$H164)","v":""},null,null,null,null,null,null,null,null,{"$f":"IF(Data!$G195=\"\",\"\",Data!$G195)","v":""},null,null,null,null,{"$f":"IF(Data!$H195=\"\",\"\",Data!$H195)","v":""}]
[null,{"$f":"Data!$G10","v":425},null,null,null,null,{"$f":"Data!$H10","v":6.8936270000000004},null,null,null,null,null,null,null,null,{"$f":"Data!$G41","v":580},null,null,null,null,{"$f":"Data!$H41","v":8.1001600000000007},null,null,null,null,null,null,null,null,{"$f":"IF(Data!$G72=\"\",\"\",Data!$G72)","v":735},null,null,null,null,{"$f":"IF(Data!$H72=\"\",\"\",Data!$H72)","v":7.1217439999999996},null,null,null,null,null,null,null,null,{"$f":"IF(Data!$G103=\"\",\"\",Data!$G103)","v":""},null,null,null,null,{"$f":"IF(Data!$H103=\"\",\"\",Data!$H103)","v":""},null,null,null,null,null,null,null,null,{"$f":"IF(Data!$G134=\"\",\"\",Data!$G134)","v":""},null,null,null,null,{"$f":"IF(Data!$H134=\"\",\"\",Data!$H134)","v":""},null,null,null,null,null,null,null,null,{"$f":"IF(Data!$G165=\"\",\"\",Data!$G165)","v":""},null,null,null,null,{"$f":"IF(Data!$H165=\"\",\"\",Data!$H165)","v":""},null,null,null,null,null,null,null,null,{"$f":"IF(Data!$G196=\"\",\"\",Data!$G196)","v":""},null,null,null,null,{"$f":"IF(Data!$H196=\"\",\"\",Data!$H196)","v":""}]
[null,{"$f":"Data!$G11","v":430},null,null,null,null,{"$f":"Data!$H11","v":6.7464190000000004},null,null,null,null,null,null,null,null,{"$f":"Data!$G42","v":585},null,null,null,null,{"$f":"Data!$H42","v":8.0237320000000008},null,null,null,null,null,null,null,null,{"$f":"IF(Data!$G73=\"\",\"\",Data!$G73)","v":740},null,null,null,null,{"$f":"IF(Data!$H73=\"\",\"\",Data!$H73)","v":7.4515640000000003},null,null,null,null,null,null,null,null,{"$f":"IF(Data!$G104=\"\",\"\",Data!$G104)","v":""},null,null,null,null,{"$f":"IF(Data!$H104=\"\",\"\",Data!$H104)","v":""},null,null,null,null,null,null,null,null,{"$f":"IF(Data!$G135=\"\",\"\",Data!$G135)","v":""},null,null,null,null,{"$f":"IF(Data!$H135=\"\",\"\",Data!$H135)","v":""},null,null,null,null,null,null,null,null,{"$f":"IF(Data!$G166=\"\",\"\",Data!$G166)","v":""},null,null,null,null,{"$f":"IF(Data!$H166=\"\",\"\",Data!$H166)","v":""},null,null,null,null,null,null,null,null,{"$f":"IF(Data!$G197=\"\",\"\",Data!$G197)","v":""},null,null,null,null,{"$f":"IF(Data!$H197=\"\",\"\",Data!$H197)","v":""}]
[null,{"$f":"Data!$G12","v":435},null,null,null,null,{"$f":"Data!$H12","v":7.1653640000000003},null,null,null,null,null,null,null,null,{"$f":"Data!$G43","v":590},null,null,null,null,{"$f":"Data!$H43","v":7.7804159999999998},null,null,null,null,null,null,null,null,{"$f":"IF(Data!$G74=\"\",\"\",Data!$G74)","v":745},null,null,null,null,{"$f":"IF(Data!$H74=\"\",\"\",Data!$H74)","v":7.6437429999999997},null,null,null,null,null,null,null,null,{"$f":"IF(Data!$G105=\"\",\"\",Data!$G105)","v":""},null,null,null,null,{"$f":"IF(Data!$H105=\"\",\"\",Data!$H105)","v":""},null,null,null,null,null,null,null,null,{"$f":"IF(Data!$G136=\"\",\"\",Data!$G136)","v":""},null,null,null,null,{"$f":"IF(Data!$H136=\"\",\"\",Data!$H136)","v":""},null,null,null,null,null,null,null,null,{"$f":"IF(Data!$G167=\"\",\"\",Data!$G167)","v":""},null,null,null,null,{"$f":"IF(Data!$H167=\"\",\"\",Data!$H167)","v":""},null,null,null,null,null,null,null,null,{"$f":"IF(Data!$G198=\"\",\"\",Data!$G198)","v":""},null,null,null,null,{"$f":"IF(Data!$H198=\"\",\"\",Data!$H198)","v":""}]
[null,{"$f":"Data!$G13","v":440},null,null,null,null,{"$f":"Data!$H13","v":7.857132},null,null,null,null,null,null,null,null,{"$f":"Data!$G44","v":595},null,null,null,null,{"$f":"Data!$H44","v":7.7598640000000003},null,null,null,null,null,null,null,null,{"$f":"IF(Data!$G75=\"\",\"\",Data!$G75)","v":750},null,null,null,null,{"$f":"IF(Data!$H75=\"\",\"\",Data!$H75)","v":7.5227430000000002},null,null,null,null,null,null,null,null,{"$f":"IF(Data!$G106=\"\",\"\",Data!$G106)","v":""},null,null,null,null,{"$f":"IF(Data!$H106=\"\",\"\",Data!$H106)","v":""},null,null,null,null,null,null,null,null,{"$f":"IF(Data!$G137=\"\",\"\",Data!$G137)","v":""},null,null,null,null,{"$f":"IF(Data!$H137=\"\",\"\",Data!$H137)","v":""},null,null,null,null,null,null,null,null,{"$f":"IF(Data!$G168=\"\",\"\",Data!$G168)","v":""},null,null,null,null,{"$f":"IF(Data!$H168=\"\",\"\",Data!$H168)","v":""},null,null,null,null,null,null,null,null,{"$f":"IF(Data!$G199=\"\",\"\",Data!$G199)","v":""},null,null,null,null,{"$f":"IF(Data!$H199=\"\",\"\",Data!$H199)","v":""}]
[null,{"$f":"Data!$G14","v":445},null,null,null,null,{"$f":"Data!$H14","v":8.4695160000000005},null,null,null,null,null,null,null,null,{"$f":"Data!$G45","v":600},null,null,null,null,{"$f":"Data!$H45","v":7.767684},null,null,null,null,null,null,null,null,{"$f":"IF(Data!$G76=\"\",\"\",Data!$G76)","v":755},null,null,null,null,{"$f":"IF(Data!$H76=\"\",\"\",Data!$H76)","v":6.6333419999999998},null,null,null,null,null,null,null,null,{"$f":"IF(Data!$G107=\"\",\"\",Data!$G107)","v":""},null,null,null,null,{"$f":"IF(Data!$H107=\"\",\"\",Data!$H107)","v":""},null,null,null,null,null,null,null,null,{"$f":"IF(Data!$G138=\"\",\"\",Data!$G138)","v":""},null,null,null,null,{"$f":"IF(Data!$H138=\"\",\"\",Data!$H138)","v":""},null,null,null,null,null,null,null,null,{"$f":"IF(Data!$G169=\"\",\"\",Data!$G169)","v":""},null,null,null,null,{"$f":"IF(Data!$H169=\"\",\"\",Data!$H169)","v":""},null,null,null,null,null,null,null,null,{"$f":"IF(Data!$G200=\"\",\"\",Data!$G200)","v":""},null,null,null,null,{"$f":"IF(Data!$H200=\"\",\"\",Data!$H200)","v":""}]
[null,{"$f":"Data!$G15","v":450},null,null,null,null,{"$f":"Data!$H15","v":9.0620759999999994},null,null,null,null,null,null,null,null,{"$f":"Data!$G46","v":605},null,null,null,null,{"$f":"Data!$H46","v":7.731814},null,null,null,null,null,null,null,null,{"$f":"IF(Data!$G77=\"\",\"\",Data!$G77)","v":760},null,null,null,null,{"$f":"IF(Data!$H77=\"\",\"\",Data!$H77)","v":5.164568},null,null,null,null,null,null,null,null,{"$f":"IF(Data!$G108=\"\",\"\",Data!$G108)","v":""},null,null,null,null,{"$f":"IF(Data!$H108=\"\",\"\",Data!$H108)","v":""},null,null,null,null,null,null,null,null,{"$f":"IF(Data!$G139=\"\",\"\",Data!$G139)","v":""},null,null,null,null,{"$f":"IF(Data!$H139=\"\",\"\",Data!$H139)","v":""},null,null,null,null,null,null,null,null,{"$f":"IF(Data!$G170=\"\",\"\",Data!$G170)","v":""},null,null,null,null,{"$f":"IF(Data!$H170=\"\",\"\",Data!$H170)","v":""},null,null,null,null,null,null,null,null,{"$f":"IF(Data!$G201=\"\",\"\",Data!$G201)","v":""},null,null,null,null,{"$f":"IF(Data!$H201=\"\",\"\",Data!$H201)","v":""}]
[null,{"$f":"Data!$G16","v":455},null,null,null,null,{"$f":"Data!$H16","v":9.3851980000000008},null,null,null,null,null,null,null,null,{"$f":"Data!$G47","v":610},null,null,null,null,{"$f":"Data!$H47","v":7.6200130000000001},null,null,null,null,null,null,null,null,{"$f":"IF(Data!$G78=\"\",\"\",Data!$G78)","v":765},null,null,null,null,{"$f":"IF(Data!$H78=\"\",\"\",Data!$H78)","v":5.1724899999999998},null,null,null,null,null,null,null,null,{"$f":"IF(Data!$G109=\"\",\"\",Data!$G109)","v":""},null,null,null,null,{"$f":"IF(Data!$H109=\"\",\"\",Data!$H109)","v":""},null,null,null,null,null,null,null,null,{"$f":"IF(Data!$G140=\"\",\"\",Data!$G140)","v":""},null,null,null,null,{"$f":"IF(Data!$H140=\"\",\"\",Data!$H140)","v":""},null,null,null,null,null,null,null,null,{"$f":"IF(Data!$G171=\"\",\"\",Data!$G171)","v":""},null,null,null,null,{"$f":"IF(Data!$H171=\"\",\"\",Data!$H171)","v":""},null,null,null,null,null,null,null,null,{"$f":"IF(Data!$G202=\"\",\"\",Data!$G202)","v":""},null,null,null,null,{"$f":"IF(Data!$H202=\"\",\"\",Data!$H202)","v":""}]
[null,{"$f":"Data!$G17","v":460},null,null,null,null,{"$f":"Data!$H17","v":9.541563},null,null,null,null,null,null,null,null,{"$f":"Data!$G48","v":615},null,null,null,null,{"$f":"Data!$H48","v":7.4500609999999998},null,null,null,null,null,null,null,null,{"$f":"IF(Data!$G79=\"\",\"\",Data!$G79)","v":770},null,null,null,null,{"$f":"IF(Data!$H79=\"\",\"\",Data!$H79)","v":6.4865500000000003},null,null,null,null,null,null,null,null,{"$f":"IF(Data!$G110=\"\",\"\",Data!$G110)","v":""},null,null,null,null,{"$f":"IF(Data!$H110=\"\",\"\",Data!$H110)","v":""},null,null,null,null,null,null,null,null,{"$f":"IF(Data!$G141=\"\",\"\",Data!$G141)","v":""},null,null,null,null,{"$f":"IF(Data!$H141=\"\",\"\",Data!$H141)","v":""},null,null,null,null,null,null,null,null,{"$f":"IF(Data!$G172=\"\",\"\",Data!$G172)","v":""},null,null,null,null,{"$f":"IF(Data!$H172=\"\",\"\",Data!$H172)","v":""},null,null,null,null,null,null,null,null,{"$f":"IF(Data!$G203=\"\",\"\",Data!$G203)","v":""},null,null,null,null,{"$f":"IF(Data!$H203=\"\",\"\",Data!$H203)","v":""}]
[null,{"$f":"Data!$G18","v":465},null,null,null,null,{"$f":"Data!$H18","v":9.4470469999999995},null,null,null,null,null,null,null,null,{"$f":"Data!$G49","v":620},null,null,null,null,{"$f":"Data!$H49","v":7.3865400000000001},null,null,null,null,null,null,null,null,{"$f":"IF(Data!$G80=\"\",\"\",Data!$G80)","v":775},null,null,null,null,{"$f":"IF(Data!$H80=\"\",\"\",Data!$H80)","v":7.1510049999999996},null,null,null,null,null,null,null,null,{"$f":"IF(Data!$G111=\"\",\"\",Data!$G111)","v":""},null,null,null,null,{"$f":"IF(Data!$H111=\"\",\"\",Data!$H111)","v":""},null,null,null,null,null,null,null,null,{"$f":"IF(Data!$G142=\"\",\"\",Data!$G142)","v":""},null,null,null,null,{"$f":"IF(Data!$H142=\"\",\"\",Data!$H142)","v":""},null,null,null,null,null,null,null,null,{"$f":"IF(Data!$G173=\"\",\"\",Data!$G173)","v":""},null,null,null,null,{"$f":"IF(Data!$H173=\"\",\"\",Data!$H173)","v":""},null,null,null,null,null,null,null,null,{"$f":"IF(Data!$G204=\"\",\"\",Data!$G204)","v":""},null,null,null,null,{"$f":"IF(Data!$H204=\"\",\"\",Data!$H204)","v":""}]
[null,{"$f":"Data!$G19","v":470},null,null,null,null,{"$f":"Data!$H19","v":9.3762030000000003},null,null,null,null,null,null,null,null,{"$f":"Data!$G50","v":625},null,null,null,null,{"$f":"Data!$H50","v":7.2048059999999996},null,null,null,null,null,null,null,null,{"$f":"IF(Data!$G81=\"\",\"\",Data!$G81)","v":780},null,null,null,null,{"$f":"IF(Data!$H81=\"\",\"\",Data!$H81)","v":7.1717950000000004},null,null,null,null,null,null,null,null,{"$f":"IF(Data!$G112=\"\",\"\",Data!$G112)","v":""},null,null,null,null,{"$f":"IF(Data!$H112=\"\",\"\",Data!$H112)","v":""},null,null,null,null,null,null,null,null,{"$f":"IF(Data!$G143=\"\",\"\",Data!$G143)","v":""},null,null,null,null,{"$f":"IF(Data!$H143=\"\",\"\",Data!$H143)","v":""},null,null,null,null,null,null,null,null,{"$f":"IF(Data!$G174=\"\",\"\",Data!$G174)","v":""},null,null,null,null,{"$f":"IF(Data!$H174=\"\",\"\",Data!$H174)","v":""},null,null,null,null,null,null,null,null,{"$f":"IF(Data!$G205=\"\",\"\",Data!$G205)","v":""},null,null,null,null,{"$f":"IF(Data!$H205=\"\",\"\",Data!$H205)","v":""}]
[null,{"$f":"Data!$G20","v":475},null,null,null,null,{"$f":"Data!$H20","v":9.4019049999999993},null,null,null,null,null,null,null,null,{"$f":"Data!$G51","v":630},null,null,null,null,{"$f":"Data!$H51","v":7.0726630000000004},null,null,null,null,null,null,null,null,{"$f":"IF(Data!$G82=\"\",\"\",Data!$G82)","v":""},null,null,null,null,{"$f":"IF(Data!$H82=\"\",\"\",Data!$H82)","v":""},null,null,null,null,null,null,null,null,{"$f":"IF(Data!$G113=\"\",\"\",Data!$G113)","v":""},null,null,null,null,{"$f":"IF(Data!$H113=\"\",\"\",Data!$H113)","v":""},null,null,null,null,null,null,null,null,{"$f":"IF(Data!$G144=\"\",\"\",Data!$G144)","v":""},null,null,null,null,{"$f":"IF(Data!$H144=\"\",\"\",Data!$H144)","v":""},null,null,null,null,null,null,null,null,{"$f":"IF(Data!$G175=\"\",\"\",Data!$G175)","v":""},null,null,null,null,{"$f":"IF(Data!$H175=\"\",\"\",Data!$H175)","v":""},null,null,null,null,null,null,null,null,{"$f":"IF(Data!$G206=\"\",\"\",Data!$G206)","v":""},null,null,null,null,{"$f":"IF(Data!$H206=\"\",\"\",Data!$H206)","v":""}]
[null,{"$f":"Data!$G21","v":480},null,null,null,null,{"$f":"Data!$H21","v":9.3887429999999998},null,null,null,null,null,null,null,null,{"$f":"Data!$G52","v":635},null,null,null,null,{"$f":"Data!$H52","v":7.0878990000000002},null,null,null,null,null,null,null,null,{"$f":"IF(Data!$G83=\"\",\"\",Data!$G83)","v":""},null,null,null,null,{"$f":"IF(Data!$H83=\"\",\"\",Data!$H83)","v":""},null,null,null,null,null,null,null,null,{"$f":"IF(Data!$G114=\"\",\"\",Data!$G114)","v":""},null,null,null,null,{"$f":"IF(Data!$H114=\"\",\"\",Data!$H114)","v":""},null,null,null,null,null,null,null,null,{"$f":"IF(Data!$G145=\"\",\"\",Data!$G145)","v":""},null,null,null,null,{"$f":"IF(Data!$H145=\"\",\"\",Data!$H145)","v":""},null,null,null,null,null,null,null,null,{"$f":"IF(Data!$G176=\"\",\"\",Data!$G176)","v":""},null,null,null,null,{"$f":"IF(Data!$H176=\"\",\"\",Data!$H176)","v":""},null,null,null,null,null,null,null,null,{"$f":"IF(Data!$G207=\"\",\"\",Data!$G207)","v":""},null,null,null,null,{"$f":"IF(Data!$H207=\"\",\"\",Data!$H207)","v":""}]
[null,{"$f":"Data!$G22","v":485},null,null,null,null,{"$f":"Data!$H22","v":9.1542910000000006},null,null,null,null,null,null,null,null,{"$f":"Data!$G53","v":640},null,null,null,null,{"$f":"Data!$H53","v":7.0419169999999998},null,null,null,null,null,null,null,null,{"$f":"IF(Data!$G84=\"\",\"\",Data!$G84)","v":""},null,null,null,null,{"$f":"IF(Data!$H84=\"\",\"\",Data!$H84)","v":""},null,null,null,null,null,null,null,null,{"$f":"IF(Data!$G115=\"\",\"\",Data!$G115)","v":""},null,null,null,null,{"$f":"IF(Data!$H115=\"\",\"\",Data!$H115)","v":""},null,null,null,null,null,null,null,null,{"$f":"IF(Data!$G146=\"\",\"\",Data!$G146)","v":""},null,null,null,null,{"$f":"IF(Data!$H146=\"\",\"\",Data!$H146)","v":""},null,null,null,null,null,null,null,null,{"$f":"IF(Data!$G177=\"\",\"\",Data!$G177)","v":""},null,null,null,null,{"$f":"IF(Data!$H177=\"\",\"\",Data!$H177)","v":""},null,null,null,null,null,null,null,null,{"$f":"IF(Data!$G208=\"\",\"\",Data!$G208)","v":""},null,null,null,null,{"$f":"IF(Data!$H208=\"\",\"\",Data!$H208)","v":""}]
[null,{"$f":"Data!$G23","v":490},null,null,null,null,{"$f":"Data!$H23","v":9.0290510000000008},null,null,null,null,null,null,null,null,{"$f":"Data!$G54","v":645},null,null,null,null,{"$f":"Data!$H54","v":6.8986169999999998},null,null,null,null,null,null,null,null,{"$f":"IF(Data!$G85=\"\",\"\",Data!$G85)","v":""},null,null,null,null,{"$f":"IF(Data!$H85=\"\",\"\",Data!$H85)","v":""},null,null,null,null,null,null,null,null,{"$f":"IF(Data!$G116=\"\",\"\",Data!$G116)","v":""},null,null,null,null,{"$f":"IF(Data!$H116=\"\",\"\",Data!$H116)","v":""},null,null,null,null,null,null,null,null,{"$f":"IF(Data!$G147=\"\",\"\",Data!$G147)","v":""},null,null,null,null,{"$f":"IF(Data!$H147=\"\",\"\",Data!$H147)","v":""},null,null,null,null,null,null,null,null,{"$f":"IF(Data!$G178=\"\",\"\",Data!$G178)","v":""},null,null,null,null,{"$f":"IF(Data!$H178=\"\",\"\",Data!$H178)","v":""},null,null,null,null,null,null,null,null,{"$f":"IF(Data!$G209=\"\",\"\",Data!$G209)","v":""},null,null,null,null,{"$f":"IF(Data!$H209=\"\",\"\",Data!$H209)","v":""}]
[null,{"$f":"Data!$G24","v":495},null,null,null,null,{"$f":"Data!$H24","v":9.1911369999999994},null,null,null,null,null,null,null,null,{"$f":"Data!$G55","v":650},null,null,null,null,{"$f":"Data!$H55","v":6.7647389999999996},null,null,null,null,null,null,null,null,{"$f":"IF(Data!$G86=\"\",\"\",Data!$G86)","v":""},null,null,null,null,{"$f":"IF(Data!$H86=\"\",\"\",Data!$H86)","v":""},null,null,null,null,null,null,null,null,{"$f":"IF(Data!$G117=\"\",\"\",Data!$G117)","v":""},null,null,null,null,{"$f":"IF(Data!$H117=\"\",\"\",Data!$H117)","v":""},null,null,null,null,null,null,null,null,{"$f":"IF(Data!$G148=\"\",\"\",Data!$G148)","v":""},null,null,null,null,{"$f":"IF(Data!$H148=\"\",\"\",Data!$H148)","v":""},null,null,null,null,null,null,null,null,{"$f":"IF(Data!$G179=\"\",\"\",Data!$G179)","v":""},null,null,null,null,{"$f":"IF(Data!$H179=\"\",\"\",Data!$H179)","v":""},null,null,null,null,null,null,null,null,{"$f":"IF(Data!$G210=\"\",\"\",Data!$G210)","v":""},null,null,null,null,{"$f":"IF(Data!$H210=\"\",\"\",Data!$H210)","v":""}]
[null,{"$f":"Data!$G25","v":500},null,null,null,null,{"$f":"Data!$H25","v":9.1107759999999995},null,null,null,null,null,null,null,null,{"$f":"Data!$G56","v":655},null,null,null,null,{"$f":"Data!$H56","v":6.6299609999999998},null,null,null,null,null,null,null,null,{"$f":"IF(Data!$G87=\"\",\"\",Data!$G87)","v":""},null,null,null,null,{"$f":"IF(Data!$H87=\"\",\"\",Data!$H87)","v":""},null,null,null,null,null,null,null,null,{"$f":"IF(Data!$G118=\"\",\"\",Data!$G118)","v":""},null,null,null,null,{"$f":"IF(Data!$H118=\"\",\"\",Data!$H118)","v":""},null,null,null,null,null,null,null,null,{"$f":"IF(Data!$G149=\"\",\"\",Data!$G149)","v":""},null,null,null,null,{"$f":"IF(Data!$H149=\"\",\"\",Data!$H149)","v":""},null,null,null,null,null,null,null,null,{"$f":"IF(Data!$G180=\"\",\"\",Data!$G180)","v":""},null,null,null,null,{"$f":"IF(Data!$H180=\"\",\"\",Data!$H180)","v":""},null,null,null,null,null,null,null,null,{"$f":"IF(Data!$G211=\"\",\"\",Data!$G211)","v":""},null,null,null,null,{"$f":"IF(Data!$H211=\"\",\"\",Data!$H211)","v":""}]
[null,{"$f":"Data!$G26","v":505},null,null,null,null,{"$f":"Data!$H26","v":9.1073210000000007},null,null,null,null,null,null,null,null,{"$f":"Data!$G57","v":660},null,null,null,null,{"$f":"Data!$H57","v":6.6271659999999999},null,null,null,null,null,null,null,null,{"$f":"IF(Data!$G88=\"\",\"\",Data!$G88)","v":""},null,null,null,null,{"$f":"IF(Data!$H88=\"\",\"\",Data!$H88)","v":""},null,null,null,null,null,null,null,null,{"$f":"IF(Data!$G119=\"\",\"\",Data!$G119)","v":""},null,null,null,null,{"$f":"IF(Data!$H119=\"\",\"\",Data!$H119)","v":""},null,null,null,null,null,null,null,null,{"$f":"IF(Data!$G150=\"\",\"\",Data!$G150)","v":""},null,null,null,null,{"$f":"IF(Data!$H150=\"\",\"\",Data!$H150)","v":""},null,null,null,null,null,null,null,null,{"$f":"IF(Data!$G181=\"\",\"\",Data!$G181)","v":""},null,null,null,null,{"$f":"IF(Data!$H181=\"\",\"\",Data!$H181)","v":""},null,null,null,null,null,null,null,null,{"$f":"IF(Data!$G212=\"\",\"\",Data!$G212)","v":""},null,null,null,null,{"$f":"IF(Data!$H212=\"\",\"\",Data!$H212)","v":""}]
[null,{"$f":"Data!$G27","v":510},null,null,null,null,{"$f":"Data!$H27","v":9.0491340000000005},null,null,null,null,null,null,null,null,{"$f":"Data!$G58","v":665},null,null,null,null,{"$f":"Data!$H58","v":6.706842},null,null,null,null,null,null,null,null,{"$f":"IF(Data!$G89=\"\",\"\",Data!$G89)","v":""},null,null,null,null,{"$f":"IF(Data!$H89=\"\",\"\",Data!$H89)","v":""},null,null,null,null,null,null,null,null,{"$f":"IF(Data!$G120=\"\",\"\",Data!$G120)","v":""},null,null,null,null,{"$f":"IF(Data!$H120=\"\",\"\",Data!$H120)","v":""},null,null,null,null,null,null,null,null,{"$f":"IF(Data!$G151=\"\",\"\",Data!$G151)","v":""},null,null,null,null,{"$f":"IF(Data!$H151=\"\",\"\",Data!$H151)","v":""},null,null,null,null,null,null,null,null,{"$f":"IF(Data!$G182=\"\",\"\",Data!$G182)","v":""},null,null,null,null,{"$f":"IF(Data!$H182=\"\",\"\",Data!$H182)","v":""},null,null,null,null,null,null,null,null,{"$f":"IF(Data!$G213=\"\",\"\",Data!$G213)","v":""},null,null,null,null,{"$f":"IF(Data!$H213=\"\",\"\",Data!$H213)","v":""}]
[null,{"$f":"Data!$G28","v":515},null,null,null,null,{"$f":"Data!$H28","v":8.8924649999999996},null,null,null,null,null,null,null,null,{"$f":"Data!$G59","v":670},null,null,null,null,{"$f":"Data!$H59","v":6.6757350000000004},null,null,null,null,null,null,null,null,{"$f":"IF(Data!$G90=\"\",\"\",Data!$G90)","v":""},null,null,null,null,{"$f":"IF(Data!$H90=\"\",\"\",Data!$H90)","v":""},null,null,null,null,null,null,null,null,{"$f":"IF(Data!$G121=\"\",\"\",Data!$G121)","v":""},null,null,null,null,{"$f":"IF(Data!$H121=\"\",\"\",Data!$H121)","v":""},null,null,null,null,null,null,null,null,{"$f":"IF(Data!$G152=\"\",\"\",Data!$G152)","v":""},null,null,null,null,{"$f":"IF(Data!$H152=\"\",\"\",Data!$H152)","v":""},null,null,null,null,null,null,null,null,{"$f":"IF(Data!$G183=\"\",\"\",Data!$G183)","v":""},null,null,null,null,{"$f":"IF(Data!$H183=\"\",\"\",Data!$H183)","v":""},null,null,null,null,null,null,null,null,{"$f":"IF(Data!$G214=\"\",\"\",Data!$G214)","v":""},null,null,null,null,{"$f":"IF(Data!$H214=\"\",\"\",Data!$H214)","v":""}]
[null,{"$f":"Data!$G29","v":520},null,null,null,null,{"$f":"Data!$H29","v":8.797625},null,null,null,null,null,null,null,null,{"$f":"Data!$G60","v":675},null,null,null,null,{"$f":"Data!$H60","v":6.5624269999999996},null,null,null,null,null,null,null,null,{"$f":"IF(Data!$G91=\"\",\"\",Data!$G91)","v":""},null,null,null,null,{"$f":"IF(Data!$H91=\"\",\"\",Data!$H91)","v":""},null,null,null,null,null,null,null,null,{"$f":"IF(Data!$G122=\"\",\"\",Data!$G122)","v":""},null,null,null,null,{"$f":"IF(Data!$H122=\"\",\"\",Data!$H122)","v":""},null,null,null,null,null,null,null,null,{"$f":"IF(Data!$G153=\"\",\"\",Data!$G153)","v":""},null,null,null,null,{"$f":"IF(Data!$H153=\"\",\"\",Data!$H153)","v":""},null,null,null,null,null,null,null,null,{"$f":"IF(Data!$G184=\"\",\"\",Data!$G184)","v":""},null,null,null,null,{"$f":"IF(Data!$H184=\"\",\"\",Data!$H184)","v":""},null,null,null,null,null,null,null,null,{"$f":"IF(Data!$G215=\"\",\"\",Data!$G215)","v":""},null,null,null,null,{"$f":"IF(Data!$H215=\"\",\"\",Data!$H215)","v":""}]
[null,{"$f":"Data!$G30","v":525},null,null,null,null,{"$f":"Data!$H30","v":8.9894829999999999},null,null,null,null,null,null,null,null,{"$f":"Data!$G61","v":680},null,null,null,null,{"$f":"Data!$H61","v":6.3496920000000001},null,null,null,null,null,null,null,null,{"$f":"IF(Data!$G92=\"\",\"\",Data!$G92)","v":""},null,null,null,null,{"$f":"IF(Data!$H92=\"\",\"\",Data!$H92)","v":""},null,null,null,null,null,null,null,null,{"$f":"IF(Data!$G123=\"\",\"\",Data!$G123)","v":""},null,null,null,null,{"$f":"IF(Data!$H123=\"\",\"\",Data!$H123)","v":""},null,null,null,null,null,null,null,null,{"$f":"IF(Data!$G154=\"\",\"\",Data!$G154)","v":""},null,null,null,null,{"$f":"IF(Data!$H154=\"\",\"\",Data!$H154)","v":""},null,null,null,null,null,null,null,null,{"$f":"IF(Data!$G185=\"\",\"\",Data!$G185)","v":""},null,null,null,null,{"$f":"IF(Data!$H185=\"\",\"\",Data!$H185)","v":""},null,null,null,null,null,null,null,null,{"$f":"IF(Data!$G216=\"\",\"\",Data!$G216)","v":""},null,null,null,null,{"$f":"IF(Data!$H216=\"\",\"\",Data!$H216)","v":""}]
[null,{"$f":"Data!$G31","v":530},null,null,null,null,{"$f":"Data!$H31","v":9.1116259999999993},null,null,null,null,null,null,null,null,{"$f":"Data!$G62","v":685},null,null,null,null,{"$f":"Data!$H62","v":5.9583259999999996},null,null,null,null,null,null,null,null,{"$f":"IF(Data!$G93=\"\",\"\",Data!$G93)","v":""},null,null,null,null,{"$f":"IF(Data!$H93=\"\",\"\",Data!$H93)","v":""},null,null,null,null,null,null,null,null,{"$f":"IF(Data!$G124=\"\",\"\",Data!$G124)","v":""},null,null,null,null,{"$f":"IF(Data!$H124=\"\",\"\",Data!$H124)","v":""},null,null,null,null,null,null,null,null,{"$f":"IF(Data!$G155=\"\",\"\",Data!$G155)","v":""},null,null,null,null,{"$f":"IF(Data!$H155=\"\",\"\",Data!$H155)","v":""},null,null,null,null,null,null,null,null,{"$f":"IF(Data!$G186=\"\",\"\",Data!$G186)","v":""},null,null,null,null,{"$f":"IF(Data!$H186=\"\",\"\",Data!$H186)","v":""},null,null,null,null,null,null,null,null,{"$f":"IF(Data!$G217=\"\",\"\",Data!$G217)","v":""},null,null,null,null,{"$f":"IF(Data!$H217=\"\",\"\",Data!$H217)","v":""}]
[]
[]
[]
[]
[]
[]
[]
[]
[]
[]
[{"$f":"'Protocol 1 (5nm)'!A54:AA54","v":"Company"}]
[{"$f":"'Protocol 1 (5nm)'!A55:AA55","v":"Address"}]
[{"$f":"'Protocol 1 (5nm)'!A56:AA56","v":"ZIP  City"}]
[]
[{"$f":"'Protocol 1 (5nm)'!A58:O58","v":"Test location,"},null,null,null,null,null,null,null,null,null,null,null,null,null,null,{"$f":"'Protocol 1 (5nm)'!P58:AA58","v":"Date"},null,null,null,null,null,null,null,null,null,null,null,null,null,null,null,null,null,null,null,null,null,null,null,null,null,null,null,null,null,null,null,null,null,null,null,null,null,null,null,null,null,null,null,null,null,null,null,{"$f":"'Protocol 1 (5nm)'!BL58:CF58","v":"First, last name of inspector"},null,null,null,null,null,null,null,null,null,null,null,null,null,null,null,null,null,null,null,null,{"$f":"'Protocol 1 (5nm)'!CG58:CX58","v":"Phone number"}]

{"sheet":"Protocol 3","index":2,"n_rows":64,"n_cols":85,"rows_kept":64,"cut":false,"hidden":false,"merged":[[63,63,63,83],[3,84,3,99],[4,62,4,83],[4,84,4,99],[5,84,5,99],[63,84,63,101],[5,62,5,83],[3,62,3,83],[60,0,60,26],[61,0,61,26],[63,0,63,14],[63,15,63,26],[0,0,1,53],[3,0,3,12],[3,13,3,58],[4,13,4,58],[5,13,5,58],[59,0,59,26]]}
[{"$f":"IF(Data!$AE$2=\"DE\",\"Messprotokoll\",IF(Data!$AE$2=\"UK\",\"Measurement protocol\",IF(Data!$AE$2=\"FR\",\"Rapport de mesure\",\"Language Error\")))","v":"Measurement protocol"}]
[]
[]
[{"$f":"IF(Data!$AE$2 = \"DE\", \"Prüfling:\", IF(Data!$AE$2 = \"UK\",\"Test object:\",IF(Data!$AE$2=\"FR\",\"Objet testé:\",\"Language Error\")))","v":"Test object:"},null,null,null,null,null,null,null,null,null,null,null,null,{"$f":"'Protocol 1 (5nm)'!N4:BG4","v":"Manufacturer"},null,null,null,null,null,null,null,null,null,null,null,null,null,null,null,null,null,null,null,null,null,null,null,null,null,null,null,null,null,null,null,null,null,null,null,null,null,null,null,null,null,null,null,null,null,null,null,null,{"$f":"IF(Data!$AE$2=\"DE\",\"Messdatei:\",IF(Data!$AE$2=\"UK\",\"Measurement file:\",IF(Data!$AE$2=\"FR\",\"Fichier de mesure:\",\"Language Error\")))","v":"Measurement file:"},null,null,null,null,null,null,null,null,null,null,null,null,null,null,null,null,null,null,null,null,null,{"$f":"Data!Q18","v":"Measured"}]
[null,null,null,null,null,null,null,null,null,null,null,null,null,{"$f":"'Protocol 1 (5nm)'!N5:BG5","v":"Type"},null,null,null,null,null,null,null,null,null,null,null,null,null,null,null,null,null,null,null,null,null,null,null,null,null,null,null,null,null,null,null,null,null,null,null,null,null,null,null,null,null,null,null,null,null,null,null,null,{"$f":"IF(Data!$AE$2=\"DE\",\"Datum der Messung:\",IF(Data!$AE$2=\"UK\",\"Date of measurement:\",IF(Data!$AE$2=\"FR\",\"Date de mesure:\",\"Language Error\")))","v":"Date of measurement:"},null,null,null,null,null,null,null,null,null,null,null,null,null,null,null,null,null,null,null,null,null,{"$f":"Data!Q23","v":"22.04.2024"}]
[null,null,null,null,null,null,null,null,null,null,null,null,null,{"$f":"'Protocol 1 (5nm)'!N6:BG6","v":"Model"},null,null,null,null,null,null,null,null,null,null,null,null,null,null,null,null,null,null,null,null,null,null,null,null,null,null,null,null,null,null,null,null,null,null,null,null,null,null,null,null,null,null,null,null,null,null,null,null,{"$f":"IF(Data!$AE$2=\"DE\",\"Uhrzeit der Messung:\",IF(Data!$AE$2=\"UK\",\"Time of measurement:\",IF(Data!$AE$2=\"FR\",\"Heure de mesure:\",\"Language Error\")))","v":"Time of measurement:"},null,null,null,null,null,null,null,null,null,null,null,null,null,null,null,null,null,null,null,null,null,{"$f":"Data!Q21","v":"14:26:00"}]
[]
[]
[]
[]
[]
[]
[]
[]
[]
[]
[]
[]
[]
[]
[]
[]
[]
[]
[]
[]
[]
[]
[]
[]
[]
[]
[]
[]
[]
[]
[]
[]
[]
[]
[]
[]
[]
[]
[]
[]
[]
[]
[]
[]
[]
[]
[]
[]
[]
[]
[]
[]
[]
[{"$f":"'Protocol 1 (5nm)'!A54:AA54","v":"Company"}]
[{"$f":"'Protocol 1 (5nm)'!A55:AA55","v":"Address"}]
[{"$f":"'Protocol 1 (5nm)'!A56:AA56","v":"ZIP  City"}]
[]
[{"$f":"'Protocol 1 (5nm)'!A58:O58","v":"Test location,"},null,null,null,null,null,null,null,null,null,null,null,null,null,null,{"$f":"'Protocol 1 (5nm)'!P58:AA58","v":"Date"},null,null,null,null,null,null,null,null,null,null,null,null,null,null,null,null,null,null,null,null,null,null,null,null,null,null,null,null,null,null,null,null,null,null,null,null,null,null,null,null,null,null,null,null,null,null,null,{"$f":"'Protocol 1 (5nm)'!BL58:CF58","v":"First, last name of inspector"},null,null,null,null,null,null,null,null,null,null,null,null,null,null,null,null,null,null,null,null,{"$f":"'Protocol 1 (5nm)'!CG58:CX58","v":"Phone number"}]

{"sheet":"Protocol TM30","index":3,"n_rows":58,"n_cols":85,"rows_kept":58,"cut":false,"hidden":false,"merged":[[57,63,57,83],[57,84,57,101],[5,62,5,83],[3,0,3,12],[3,13,3,58],[4,13,4,58],[5,13,5,58],[3,62,3,83],[53,0,53,26],[54,0,54,26],[55,0,55,26],[57,0,57,14],[57,15,57,26],[0,0,1,53],[3,84,3,99],[4,62,4,83],[4,84,4,99],[5,84,5,99]]}
[{"$f":"IF(Data!$AE$2=\"DE\",\"Messprotokoll\",IF(Data!$AE$2=\"UK\",\"Measurement protocol\",IF(Data!$AE$2=\"FR\",\"Rapport de mesure\",\"Language Error\")))","v":"Measurement protocol"}]
[]
[]
[{"$f":"IF(Data!$AE$2 = \"DE\", \"Prüfling:\", IF(Data!$AE$2 = \"UK\",\"Test object:\",IF(Data!$AE$2=\"FR\",\"Objet testé:\",\"Language Error\")))","v":"Test object:"},null,null,null,null,null,null,null,null,null,null,null,null,{"$f":"'Protocol 1 (5nm)'!N4:BG4","v":"Manufacturer"},null,null,null,null,null,null,null,null,null,null,null,null,null,null,null,null,null,null,null,null,null,null,null,null,null,null,null,null,null,null,null,null,null,null,null,null,null,null,null,null,null,null,null,null,null,null,null,null,{"$f":"IF(Data!$AE$2=\"DE\",\"Messdatei:\",IF(Data!$AE$2=\"UK\",\"Measurement file:\",IF(Data!$AE$2=\"FR\",\"Fichier de mesure:\",\"Language Error\")))","v":"Measurement file:"},null,null,null,null,null,null,null,null,null,null,null,null,null,null,null,null,null,null,null,null,null,{"$f":"Data!Q18","v":"Measured"}]
[null,null,null,null,null,null,null,null,null,null,null,null,null,{"$f":"'Protocol 1 (5nm)'!N5:BG5","v":"Type"},null,null,null,null,null,null,null,null,null,null,null,null,null,null,null,null,null,null,null,null,null,null,null,null,null,null,null,null,null,null,null,null,null,null,null,null,null,null,null,null,null,null,null,null,null,null,null,null,{"$f":"IF(Data!$AE$2=\"DE\",\"Datum der Messung:\",IF(Data!$AE$2=\"UK\",\"Date of measurement:\",IF(Data!$AE$2=\"FR\",\"Date de mesure:\",\"Language Error\")))","v":"Date of measurement:"},null,null,null,null,null,null,null,null,null,null,null,null,null,null,null,null,null,null,null,null,null,{"$f":"Data!Q23","v":"22.04.2024"}]
[null,null,null,null,null,null,null,null,null,null,null,null,null,{"$f":"'Protocol 1 (5nm)'!N6:BG6","v":"Model"},null,null,null,null,null,null,null,null,null,null,null,null,null,null,null,null,null,null,null,null,null,null,null,null,null,null,null,null,null,null,null,null,null,null,null,null,null,null,null,null,null,null,null,null,null,null,null,null,{"$f":"IF(Data!$AE$2=\"DE\",\"Uhrzeit der Messung:\",IF(Data!$AE$2=\"UK\",\"Time of measurement:\",IF(Data!$AE$2=\"FR\",\"Heure de mesure:\",\"Language Error\")))","v":"Time of measurement:"},null,null,null,null,null,null,null,null,null,null,null,null,null,null,null,null,null,null,null,null,null,{"$f":"Data!Q21","v":"14:26:00"}]
[]
[]
[]
[]
[]
[]
[]
[]
[]
[]
[]
[]
[]
[]
[]
[]
[]
[]
[]
[]
[]
[]
[]
[]
[]
[]
[]
[]
[]
[]
[]
[]
[]
[]
[]
[]
[]
[]
[]
[]
[]
[]
[]
[]
[]
[]
[]
[{"$f":"'Protocol 1 (5nm)'!A54:AA54","v":"Company"}]
[{"$f":"'Protocol 1 (5nm)'!A55:AA55","v":"Address"}]
[{"$f":"'Protocol 1 (5nm)'!A56:AA56","v":"ZIP  City"}]
[]
[{"$f":"'Protocol 1 (5nm)'!A58:O58","v":"Test location,"},null,null,null,null,null,null,null,null,null,null,null,null,null,null,{"$f":"'Protocol 1 (5nm)'!P58:AA58","v":"Date"},null,null,null,null,null,null,null,null,null,null,null,null,null,null,null,null,null,null,null,null,null,null,null,null,null,null,null,null,null,null,null,null,null,null,null,null,null,null,null,null,null,null,null,null,null,null,null,{"$f":"'Protocol 1 (5nm)'!BL58:CF58","v":"First, last name of inspector"},null,null,null,null,null,null,null,null,null,null,null,null,null,null,null,null,null,null,null,null,{"$f":"'Protocol 1 (5nm)'!CG58:CX58","v":"Phone number"}]

{"sheet":"Protocol Flicker","index":4,"n_rows":58,"n_cols":85,"rows_kept":58,"cut":false,"hidden":false,"merged":[[57,0,57,14],[57,15,57,26],[57,63,57,83],[57,84,57,101],[22,3,22,33],[22,34,22,50],[23,3,23,33],[23,34,23,50],[24,3,24,33],[24,34,24,50],[55,0,55,26],[5,13,5,58],[5,62,5,83],[5,84,5,99],[53,0,53,26],[54,0,54,26],[4,13,4,58],[4,62,4,83],[4,84,4,99],[0,0,1,53],[3,0,3,12],[3,13,3,58],[3,62,3,83],[3,84,3,99]]}
[{"$f":"IF(Data!$AE$2=\"DE\",\"Messprotokoll\",IF(Data!$AE$2=\"UK\",\"Measurement protocol\",IF(Data!$AE$2=\"FR\",\"Rapport de mesure\",\"Language Error\")))","v":"Measurement protocol"}]
[]
[]
[{"$f":"IF(Data!$AE$2 = \"DE\", \"Prüfling:\", IF(Data!$AE$2 = \"UK\",\"Test object:\",IF(Data!$AE$2=\"FR\",\"Objet testé:\",\"Language Error\")))","v":"Test object:"},null,null,null,null,null,null,null,null,null,null,null,null,{"$f":"'Protocol 1 (5nm)'!N4:BG4","v":"Manufacturer"},null,null,null,null,null,null,null,null,null,null,null,null,null,null,null,null,null,null,null,null,null,null,null,null,null,null,null,null,null,null,null,null,null,null,null,null,null,null,null,null,null,null,null,null,null,null,null,null,{"$f":"IF(Data!$AE$2=\"DE\",\"Messdatei:\",IF(Data!$AE$2=\"UK\",\"Measurement file:\",IF(Data!$AE$2=\"FR\",\"Fichier de mesure:\",\"Language Error\")))","v":"Measurement file:"},null,null,null,null,null,null,null,null,null,null,null,null,null,null,null,null,null,null,null,null,null,{"$f":"Data!Q18","v":"Measured"}]
[null,null,null,null,null,null,null,null,null,null,null,null,null,{"$f":"'Protocol 1 (5nm)'!N5:BG5","v":"Type"},null,null,null,null,null,null,null,null,null,null,null,null,null,null,null,null,null,null,null,null,null,null,null,null,null,null,null,null,null,null,null,null,null,null,null,null,null,null,null,null,null,null,null,null,null,null,null,null,{"$f":"IF(Data!$AE$2=\"DE\",\"Datum der Messung:\",IF(Data!$AE$2=\"UK\",\"Date of measurement:\",IF(Data!$AE$2=\"FR\",\"Date de mesure:\",\"Language Error\")))","v":"Date of measurement:"},null,null,null,null,null,null,null,null,null,null,null,null,null,null,null,null,null,null,null,null,null,{"$f":"Data!Q23","v":"22.04.2024"}]
[null,null,null,null,null,null,null,null,null,null,null,null,null,{"$f":"'Protocol 1 (5nm)'!N6:BG6","v":"Model"},null,null,null,null,null,null,null,null,null,null,null,null,null,null,null,null,null,null,null,null,null,null,null,null,null,null,null,null,null,null,null,null,null,null,null,null,null,null,null,null,null,null,null,null,null,null,null,null,{"$f":"IF(Data!$AE$2=\"DE\",\"Uhrzeit der Messung:\",IF(Data!$AE$2=\"UK\",\"Time of measurement:\",IF(Data!$AE$2=\"FR\",\"Heure de mesure:\",\"Language Error\")))","v":"Time of measurement:"},null,null,null,null,null,null,null,null,null,null,null,null,null,null,null,null,null,null,null,null,null,{"$f":"Data!Q21","v":"14:26:00"}]
[]
[]
[]
[]
[]
[]
[]
[]
[]
[]
[]
[]
[]
[]
[]
[]
[null,null,null,{"$f":"IF(Data!$AE$2 = \"DE\", \"Flickerfrequenz\", IF(Data!$AE$2 = \"UK\",\"Flicker frequency\",IF(Data!$AE$2=\"FR\",\"Fréquence flicker\",\"Language Error\")))","v":"Flicker frequency"},null,null,null,null,null,null,null,null,null,null,null,null,null,null,null,null,null,null,null,null,null,null,null,null,null,null,null,null,null,null,{"$f":"Data!K36","v":0}]
[null,null,null,{"$f":"IF(Data!$AE$2 = \"DE\", \"Prozent Flicker\", IF(Data!$AE$2 = \"UK\",\"Percent Flicker\",IF(Data!$AE$2=\"FR\",\"% flicker\",\"Language Error\")))","v":"Percent Flicker"},null,null,null,null,null,null,null,null,null,null,null,null,null,null,null,null,null,null,null,null,null,null,null,null,null,null,null,null,null,null,{"$f":"Data!K37","v":1.052689}]
[null,null,null,{"$f":"IF(Data!$AE$2 = \"DE\", \"Flickerindex\", IF(Data!$AE$2 = \"UK\",\"Flicker index\",IF(Data!$AE$2=\"FR\",\"Index flicker\",\"Language Error\")))","v":"Flicker index"},null,null,null,null,null,null,null,null,null,null,null,null,null,null,null,null,null,null,null,null,null,null,null,null,null,null,null,null,null,null,{"$f":"Data!K35","v":1.261E-3}]
[]
[]
[]
[]
[]
[]
[]
[]
[]
[]
[]
[]
[]
[]
[]
[]
[]
[]
[]
[]
[]
[]
[]
[]
[]
[]
[]
[]
[{"$f":"'Protocol 1 (5nm)'!A54:AA54","v":"Company"}]
[{"$f":"'Protocol 1 (5nm)'!A55:AA55","v":"Address"}]
[{"$f":"'Protocol 1 (5nm)'!A56:AA56","v":"ZIP  City"}]
[]
[{"$f":"'Protocol 1 (5nm)'!A58:O58","v":"Test location,"},null,null,null,null,null,null,null,null,null,null,null,null,null,null,{"$f":"'Protocol 1 (5nm)'!P58:AA58","v":"Date"},null,null,null,null,null,null,null,null,null,null,null,null,null,null,null,null,null,null,null,null,null,null,null,null,null,null,null,null,null,null,null,null,null,null,null,null,null,null,null,null,null,null,null,null,null,null,null,{"$f":"'Protocol 1 (5nm)'!BL58:CF58","v":"First, last name of inspector"},null,null,null,null,null,null,null,null,null,null,null,null,null,null,null,null,null,null,null,null,{"$f":"'Protocol 1 (5nm)'!CG58:CX58","v":"Phone number"}]

{"sheet":"Protocol TLCI","index":5,"n_rows":58,"n_cols":85,"rows_kept":58,"cut":false,"hidden":false,"merged":[[0,0,1,53],[3,0,3,12],[3,13,3,58],[3,62,3,83],[3,84,3,99],[57,0,57,14],[57,15,57,26],[57,63,57,83],[57,84,57,101],[5,13,5,58],[5,62,5,83],[5,84,5,99],[53,0,53,26],[54,0,54,26],[55,0,55,26],[23,3,23,33],[23,34,23,50],[25,3,25,7],[25,8,25,17],[28,3,28,7],[28,8,28,17],[29,3,29,7],[29,8,29,17],[26,3,26,7],[26,8,26,17],[27,3,27,7],[27,8,27,17],[4,13,4,58],[4,62,4,83],[4,84,4,99],[22,3,22,33],[22,34,22,50],[22,54,22,75],[22,76,22,98],[25,28,25,37],[26,28,26,37],[27,28,27,37],[36,8,36,17],[37,3,37,7],[37,8,37,17],[36,18,36,27],[37,18,37,27],[32,28,32,37],[33,28,33,37],[30,3,30,7],[30,8,30,17],[31,3,31,7],[31,8,31,17],[30,18,30,27],[31,18,31,27],[30,28,30,37],[31,28,31,37],[32,3,32,7],[32,8,32,17],[33,3,33,7],[33,8,33,17],[32,18,32,27],[33,18,33,27],[28,28,28,37],[29,28,29,37],[25,18,25,27],[26,18,26,27],[27,18,27,27],[28,18,28,27],[29,18,29,27],[43,59,43,78],[43,79,43,86],[43,23,43,30],[43,3,43,22],[43,31,43,50],[43,51,43,58],[36,28,36,37],[37,28,37,37],[34,3,34,7],[34,8,34,17],[35,3,35,7],[35,8,35,17],[34,18,34,27],[35,18,35,27],[34,28,34,37],[35,28,35,37],[36,3,36,7],[44,31,44,35],[45,31,45,35],[46,31,46,35],[47,31,47,35],[48,31,48,35],[49,31,49,35],[49,36,49,50],[44,51,44,58],[45,51,45,58],[46,51,46,58],[47,51,47,58],[48,51,48,58],[49,51,49,58],[44,36,44,50],[45,36,45,50],[44,3,44,7],[44,8,44,22],[44,23,44,30],[45,23,45,30],[46,23,46,30],[47,23,47,30],[48,23,48,30],[49,23,49,30],[45,3,45,7],[46,3,46,7],[47,3,47,7],[48,3,48,7],[49,3,49,7],[48,8,48,22],[45,8,45,22],[46,8,46,22],[47,8,47,22],[49,8,49,22],[44,64,44,78],[45,64,45,78],[46,64,46,78],[47,64,47,78],[48,64,48,78],[49,64,49,78],[49,79,49,86],[46,36,46,50],[47,36,47,50],[48,36,48,50],[45,79,45,86],[46,79,46,86],[47,79,47,86],[48,79,48,86],[48,59,48,63],[49,59,49,63],[44,59,44,63],[45,59,45,63],[46,59,46,63],[47,59,47,63],[44,79,44,86]]}
[{"$f":"IF(Data!$AE$2=\"DE\",\"Messprotokoll\",IF(Data!$AE$2=\"UK\",\"Measurement protocol\",IF(Data!$AE$2=\"FR\",\"Rapport de mesure\",\"Language Error\")))","v":"Measurement protocol"}]
[]
[]
[{"$f":"IF(Data!$AE$2 = \"DE\", \"Prüfling:\", IF(Data!$AE$2 = \"UK\",\"Test object:\",IF(Data!$AE$2=\"FR\",\"Objet testé:\",\"Language Error\")))","v":"Test object:"},null,null,null,null,null,null,null,null,null,null,null,null,{"$f":"'Protocol 1 (5nm)'!N4:BG4","v":"Manufacturer"},null,null,null,null,null,null,null,null,null,null,null,null,null,null,null,null,null,null,null,null,null,null,null,null,null,null,null,null,null,null,null,null,null,null,null,null,null,null,null,null,null,null,null,null,null,null,null,null,{"$f":"IF(Data!$AE$2=\"DE\",\"Messdatei:\",IF(Data!$AE$2=\"UK\",\"Measurement file:\",IF(Data!$AE$2=\"FR\",\"Fichier de mesure:\",\"Language Error\")))","v":"Measurement file:"},null,null,null,null,null,null,null,null,null,null,null,null,null,null,null,null,null,null,null,null,null,{"$f":"Data!Q18","v":"Measured"}]
[null,null,null,null,null,null,null,null,null,null,null,null,null,{"$f":"'Protocol 1 (5nm)'!N5:BG5","v":"Type"},null,null,null,null,null,null,null,null,null,null,null,null,null,null,null,null,null,null,null,null,null,null,null,null,null,null,null,null,null,null,null,null,null,null,null,null,null,null,null,null,null,null,null,null,null,null,null,null,{"$f":"IF(Data!$AE$2=\"DE\",\"Datum der Messung:\",IF(Data!$AE$2=\"UK\",\"Date of measurement:\",IF(Data!$AE$2=\"FR\",\"Date de mesure:\",\"Language Error\")))","v":"Date of measurement:"},null,null,null,null,null,null,null,null,null,null,null,null,null,null,null,null,null,null,null,null,null,{"$f":"Data!Q23","v":"22.04.2024"}]
[null,null,null,null,null,null,null,null,null,null,null,null,null,{"$f":"'Protocol 1 (5nm)'!N6:BG6","v":"Model"},null,null,null,null,null,null,null,null,null,null,null,null,null,null,null,null,null,null,null,null,null,null,null,null,null,null,null,null,null,null,null,null,null,null,null,null,null,null,null,null,null,null,null,null,null,null,null,null,{"$f":"IF(Data!$AE$2=\"DE\",\"Uhrzeit der Messung:\",IF(Data!$AE$2=\"UK\",\"Time of measurement:\",IF(Data!$AE$2=\"FR\",\"Heure de mesure:\",\"Language Error\")))","v":"Time of measurement:"},null,null,null,null,null,null,null,null,null,null,null,null,null,null,null,null,null,null,null,null,null,{"$f":"Data!Q21","v":"14:26:00"}]
[]
[]
[]
[]
[]
[]
[]
[]
[]
[]
[]
[]
[]
[]
[]
[]
[null,null,null,{"$f":"IF(Data!$AE$2 = \"DE\", \"Ähnlichste Farbtemperatur (CCT)\", IF(Data!$AE$2 = \"UK\",\"correlated color temperature (CCT)\",IF(Data!$AE$2=\"FR\",\"Temp. de couleur proximale (CCT)\",\"Language Error\")))","v":"correlated color temperature (CCT)"},null,null,null,null,null,null,null,null,null,null,null,null,null,null,null,null,null,null,null,null,null,null,null,null,null,null,null,null,null,null,{"$f":"Data!K30","v":6137},null,null,null,null,null,null,null,null,null,null,null,null,null,null,null,null,null,null,null,{"$f":"IF(Data!$AE$2 = \"DE\", \"Referenzspektrum\", IF(Data!$AE$2 = \"UK\",\"Referencec Spectrum\",IF(Data!$AE$2=\"FR\",\"Spectre de référence\",\"Language Error\")))","v":"Referencec Spectrum"},null,null,null,null,null,null,null,null,null,null,null,null,null,null,null,null,null,null,null,null,null,{"$f":"Data!Q31","v":"Daylight"}]
[null,null,null,"TLCI",null,null,null,null,null,null,null,null,null,null,null,null,null,null,null,null,null,null,null,null,null,null,null,null,null,null,null,null,null,null,{"$f":"Data!Q30","v":100}]
[]
[null,null,null,null,null,null,null,null,"Lightness",null,null,null,null,null,null,null,null,null,"Chroma",null,null,null,null,null,null,null,null,null,"Hue"]
[null,null,null,"R",null,null,null,null,{"$f":"Data!Q50","v":0},null,null,null,null,null,null,null,null,null,{"$f":"Data!Q51","v":0},null,null,null,null,null,null,null,null,null,{"$f":"Data!Q52","v":0}]
[null,null,null,"R/Y",null,null,null,null,{"$f":"Data!Q53","v":0},null,null,null,null,null,null,null,null,null,{"$f":"Data!Q54","v":0},null,null,null,null,null,null,null,null,null,{"$f":"Data!Q55","v":0}]
[null,null,null,"Y",null,null,null,null,{"$f":"Data!Q56","v":0},null,null,null,null,null,null,null,null,null,{"$f":"Data!Q57","v":0},null,null,null,null,null,null,null,null,null,{"$f":"Data!Q58","v":0}]
[null,null,null,"Y/G",null,null,null,null,{"$f":"Data!Q59","v":0},null,null,null,null,null,null,null,null,null,{"$f":"Data!Q60","v":0},null,null,null,null,null,null,null,null,null,{"$f":"Data!Q61","v":0}]
[null,null,null,"G",null,null,null,null,{"$f":"Data!Q62","v":0},null,null,null,null,null,null,null,null,null,{"$f":"Data!Q63","v":0},null,null,null,null,null,null,null,null,null,{"$f":"Data!Q64","v":0}]
[null,null,null,"G/C",null,null,null,null,{"$f":"Data!Q65","v":0},null,null,null,null,null,null,null,null,null,{"$f":"Data!Q66","v":0},null,null,null,null,null,null,null,null,null,{"$f":"Data!Q67","v":0}]
[null,null,null,"C",null,null,null,null,{"$f":"Data!Q68","v":0},null,null,null,null,null,null,null,null,null,{"$f":"Data!Q69","v":0},null,null,null,null,null,null,null,null,null,{"$f":"Data!Q70","v":0}]
[null,null,null,"C/B",null,null,null,null,{"$f":"Data!Q71","v":0},null,null,null,null,null,null,null,null,null,{"$f":"Data!Q72","v":0},null,null,null,null,null,null,null,null,null,{"$f":"Data!Q73","v":0}]
[null,null,null,"B",null,null,null,null,{"$f":"Data!Q74","v":0},null,null,null,null,null,null,null,null,null,{"$f":"Data!Q75","v":0},null,null,null,null,null,null,null,null,null,{"$f":"Data!Q76","v":0}]
[null,null,null,"B/M",null,null,null,null,{"$f":"Data!Q77","v":0},null,null,null,null,null,null,null,null,null,{"$f":"Data!Q78","v":0},null,null,null,null,null,null,null,null,null,{"$f":"Data!Q79","v":0}]
[null,null,null,"M",null,null,null,null,{"$f":"Data!Q80","v":0},null,null,null,null,null,null,null,null,null,{"$f":"Data!Q81","v":0},null,null,null,null,null,null,null,null,null,{"$f":"Data!Q82","v":0}]
[null,null,null,"M/R",null,null,null,null,{"$f":"Data!Q83","v":0},null,null,null,null,null,null,null,null,null,{"$f":"Data!Q84","v":0},null,null,null,null,null,null,null,null,null,{"$f":"Data!Q85","v":0}]
[]
[]
[]
[]
[]
[null,null,null,{"$f":"IF(Data!$AE$2 = \"DE\", \"Testfarbe\", IF(Data!$AE$2 = \"UK\",\"Test Colour\",IF(Data!$AE$2=\"FR\",\"Couleur de test\",\"Language Error\")))","v":"Test Colour"},null,null,null,null,null,null,null,null,null,null,null,null,null,null,null,null,null,null,null,{"$f":"IF(Data!$AE$2 = \"DE\", \"Wert\", IF(Data!$AE$2 = \"UK\",\"Value\",IF(Data!$AE$2=\"FR\",\"Valeur\",\"Language Error\")))","v":"Value"},null,null,null,null,null,null,null,{"$f":"IF(Data!$AE$2 = \"DE\", \"Testfarbe\", IF(Data!$AE$2 = \"UK\",\"Test Colour\",IF(Data!$AE$2=\"FR\",\"Couleur de test\",\"Language Error\")))","v":"Test Colour"},null,null,null,null,null,null,null,null,null,null,null,null,null,null,null,null,null,null,null,{"$f":"IF(Data!$AE$2 = \"DE\", \"Wert\", IF(Data!$AE$2 = \"UK\",\"Value\",IF(Data!$AE$2=\"FR\",\"Valeur\",\"Language Error\")))","v":"Value"},null,null,null,null,null,null,null,{"$f":"IF(Data!$AE$2 = \"DE\", \"Testfarbe\", IF(Data!$AE$2 = \"UK\",\"Test Colour\",IF(Data!$AE$2=\"FR\",\"Couleur de test\",\"Language Error\")))","v":"Test Colour"},null,null,null,null,null,null,null,null,null,null,null,null,null,null,null,null,null,null,null,{"$f":"IF(Data!$AE$2 = \"DE\", \"Wert\", IF(Data!$AE$2 = \"UK\",\"Value\",IF(Data!$AE$2=\"FR\",\"Valeur\",\"Language Error\")))","v":"Value"}]
[null,null,null,"Q1",null,null,null,null,"Dark skin",null,null,null,null,null,null,null,null,null,null,null,null,null,null,{"$f":"Data!Q32","v":99},null,null,null,null,null,null,null,"Q7",null,null,null,null,"Orange",null,null,null,null,null,null,null,null,null,null,null,null,null,null,{"$f":"Data!Q38","v":99},null,null,null,null,null,null,null,"Q13",null,null,null,null,"Blue",null,null,null,null,null,null,null,null,null,null,null,null,null,null,{"$f":"Data!Q44","v":99}]
[null,null,null,"Q2",null,null,null,null,"Light skin",null,null,null,null,null,null,null,null,null,null,null,null,{"$f":"Data!Q33","v":99},null,{"$f":"Data!Q33","v":99},null,null,null,null,null,null,null,"Q8",null,null,null,null,"Purplish blue",null,null,null,null,null,null,null,null,null,null,null,null,null,null,{"$f":"Data!Q39","v":99},null,null,null,null,null,null,null,"Q14",null,null,null,null,"Green",null,null,null,null,null,null,null,null,null,null,null,null,null,null,{"$f":"Data!Q45","v":99}]
[null,null,null,"Q3",null,null,null,null,"Blue sky",null,null,null,null,null,null,null,null,null,null,null,null,{"$f":"Data!Q34","v":99},null,{"$f":"Data!Q34","v":99},null,null,null,null,null,null,null,"Q9",null,null,null,null,"Moderate red",null,null,null,null,null,null,null,null,null,null,null,null,null,null,{"$f":"Data!Q40","v":99},null,null,null,null,null,null,null,"Q15",null,null,null,null,"Red",null,null,null,null,null,null,null,null,null,null,null,null,null,null,{"$f":"Data!Q46","v":99}]
[null,null,null,"Q4",null,null,null,null,"Foliage",null,null,null,null,null,null,null,null,null,null,null,null,{"$f":"Data!Q35","v":99},null,{"$f":"Data!Q35","v":99},null,null,null,null,null,null,null,"Q10",null,null,null,null,"Purple",null,null,null,null,null,null,null,null,null,null,null,null,null,null,{"$f":"Data!Q41","v":99},null,null,null,null,null,null,null,"Q16",null,null,null,null,"Yellow",null,null,null,null,null,null,null,null,null,null,null,null,null,null,{"$f":"Data!Q47","v":99}]
[null,null,null,"Q5",null,null,null,null,"Blue flower",null,null,null,null,null,null,null,null,null,null,null,null,{"$f":"Data!Q36","v":99},null,{"$f":"Data!Q36","v":99},null,null,null,null,null,null,null,"Q11",null,null,null,null,"Yellow green",null,null,null,null,null,null,null,null,null,null,null,null,null,null,{"$f":"Data!Q42","v":99},null,null,null,null,null,null,null,"Q17",null,null,null,null,"Magenta",null,null,null,null,null,null,null,null,null,null,null,null,null,null,{"$f":"Data!Q48","v":99}]
[null,null,null,"Q6",null,null,null,null,"Bluish green",null,null,null,null,null,null,null,null,null,null,null,null,{"$f":"Data!Q37","v":99},null,{"$f":"Data!Q37","v":99},null,null,null,null,null,null,null,"Q12",null,null,null,null,"Orange yellow",null,null,null,null,null,null,null,null,null,null,null,null,null,null,{"$f":"Data!Q43","v":99},null,null,null,null,null,null,null,"Q18",null,null,null,null,"Cyan",null,null,null,null,null,null,null,null,null,null,null,null,null,null,{"$f":"Data!Q49","v":99}]
[]
[]
[]
[{"$f":"'Protocol 1 (5nm)'!A54:AA54","v":"Company"}]
[{"$f":"'Protocol 1 (5nm)'!A55:AA55","v":"Address"}]
[{"$f":"'Protocol 1 (5nm)'!A56:AA56","v":"ZIP  City"}]
[]
[{"$f":"'Protocol 1 (5nm)'!A58:O58","v":"Test location,"},null,null,null,null,null,null,null,null,null,null,null,null,null,null,{"$f":"'Protocol 1 (5nm)'!P58:AA58","v":"Date"},null,null,null,null,null,null,null,null,null,null,null,null,null,null,null,null,null,null,null,null,null,null,null,null,null,null,null,null,null,null,null,null,null,null,null,null,null,null,null,null,null,null,null,null,null,null,null,{"$f":"'Protocol 1 (5nm)'!BL58:CF58","v":"First, last name of inspector"},null,null,null,null,null,null,null,null,null,null,null,null,null,null,null,null,null,null,null,null,{"$f":"'Protocol 1 (5nm)'!CG58:CX58","v":"Phone number"}]

{"sheet":"Reference Comparison","index":6,"n_rows":55,"n_cols":92,"rows_kept":55,"cut":false,"hidden":false,"merged":[[5,13,5,58],[5,62,5,83],[5,84,5,99],[6,62,6,83],[6,84,6,99],[7,62,7,83],[7,84,7,99],[0,0,1,53],[3,0,3,12],[3,13,3,58],[3,62,3,83],[3,84,3,99],[4,13,4,58],[4,62,4,83],[4,84,4,99],[8,62,8,83],[8,84,8,99],[24,1,24,5],[24,6,24,15],[24,16,24,28],[24,29,24,34],[24,36,24,65],[24,66,24,77],[24,78,24,90],[24,91,24,101],[25,78,25,90],[25,91,25,101],[26,1,26,5],[26,6,26,15],[26,16,26,28],[26,29,26,34],[26,36,26,65],[26,66,26,77],[26,78,26,90],[26,91,26,101],[25,1,25,5],[25,6,25,15],[25,16,25,28],[25,29,25,34],[25,36,25,65],[25,66,25,77],[27,78,27,90],[27,91,27,101],[28,1,28,5],[28,6,28,15],[28,16,28,28],[28,29,28,34],[27,1,27,5],[27,6,27,15],[27,16,27,28],[27,29,27,34],[27,36,27,65],[27,66,27,77],[29,78,29,90],[29,91,29,101],[30,1,30,5],[30,6,30,15],[30,16,30,28],[30,29,30,34],[30,36,30,65],[30,66,30,77],[30,78,30,90],[30,91,30,101],[29,1,29,5],[29,6,29,15],[29,16,29,28],[29,29,29,34],[29,36,29,65],[29,66,29,77],[32,36,32,65],[32,66,32,77],[32,78,32,90],[32,91,32,101],[33,1,33,5],[33,6,33,15],[33,16,33,28],[33,29,33,34],[31,1,31,5],[31,6,31,15],[31,16,31,28],[31,29,31,34],[32,1,32,5],[32,6,32,15],[32,16,32,28],[32,29,32,34],[34,91,34,101],[35,1,35,5],[35,6,35,15],[35,16,35,28],[35,29,35,34],[35,36,35,65],[35,66,35,77],[35,78,35,90],[35,91,35,101],[34,1,34,5],[34,6,34,15],[34,16,34,28],[34,29,34,34],[34,36,34,65],[34,66,34,77],[36,1,36,5],[36,6,36,15],[36,16,36,28],[36,29,36,34],[37,1,37,5],[37,6,37,15],[37,16,37,28],[37,29,37,34],[34,78,34,90],[38,78,38,90],[38,91,38,101],[39,1,39,5],[39,6,39,15],[39,16,39,28],[39,29,39,34],[37,36,37,65],[37,66,37,77],[37,78,37,90],[37,91,37,101],[38,1,38,5],[38,6,38,15],[38,16,38,28],[38,29,38,34],[38,36,38,65],[38,66,38,77],[40,78,40,90],[40,91,40,101],[41,36,41,65],[41,66,41,77],[41,78,41,90],[41,91,41,101],[40,1,40,5],[40,6,40,15],[40,16,40,28],[40,29,40,34],[40,36,40,65],[40,66,40,77],[42,78,42,90],[42,91,42,101],[43,1,43,5],[43,6,43,15],[43,16,43,28],[43,29,43,34],[43,36,43,65],[43,66,43,77],[43,78,43,90],[43,91,43,101],[42,1,42,5],[42,6,42,15],[42,16,42,28],[42,29,42,34],[42,36,42,65],[42,66,42,77],[54,84,54,101],[50,0,50,26],[51,0,51,26],[52,0,52,26],[54,0,54,14],[54,15,54,26],[54,63,54,83],[44,36,44,65],[44,66,44,77],[44,78,44,90],[44,91,44,101],[45,36,45,65],[45,66,45,77],[45,78,45,90],[45,91,45,101],[45,1,45,5],[45,6,45,15],[45,16,45,28],[45,29,45,34]]}
[{"$f":"IF(Data!$AE$2=\"DE\",\"Messprotokoll\",IF(Data!$AE$2=\"UK\",\"Measurement protocol\",IF(Data!$AE$2=\"FR\",\"Rapport de mesure\",\"Language Error\")))","v":"Measurement protocol"}]
[]
[]
[{"$f":"IF(Data!$AE$2 = \"DE\", \"Prüfling:\", IF(Data!$AE$2 = \"UK\",\"Test object:\",IF(Data!$AE$2=\"FR\",\"Objet testé:\",\"Language Error\")))","v":"Test object:"},null,null,null,null,null,null,null,null,null,null,null,null,{"$f":"'Protocol 1 (5nm)'!N4:BG4","v":"Manufacturer"},null,null,null,null,null,null,null,null,null,null,null,null,null,null,null,null,null,null,null,null,null,null,null,null,null,null,null,null,null,null,null,null,null,null,null,null,null,null,null,null,null,null,null,null,null,null,null,null,{"$f":"IF(Data!$AE$2=\"DE\",\"Messdatei:\",IF(Data!$AE$2=\"UK\",\"Measurement file:\",IF(Data!$AE$2=\"FR\",\"Fichier de mesure:\",\"Language Error\")))","v":"Measurement file:"},null,null,null,null,null,null,null,null,null,null,null,null,null,null,null,null,null,null,null,null,null,{"$f":"Data!Q18","v":"Measured"}]
[null,null,null,null,null,null,null,null,null,null,null,null,null,{"$f":"'Protocol 1 (5nm)'!N5:BG5","v":"Type"},null,null,null,null,null,null,null,null,null,null,null,null,null,null,null,null,null,null,null,null,null,null,null,null,null,null,null,null,null,null,null,null,null,null,null,null,null,null,null,null,null,null,null,null,null,null,null,null,{"$f":"IF(Data!$AE$2=\"DE\",\"Datum der Messung:\",IF(Data!$AE$2=\"UK\",\"Date of measurement:\",IF(Data!$AE$2=\"FR\",\"Date de mesure:\",\"Language Error\")))","v":"Date of measurement:"},null,null,null,null,null,null,null,null,null,null,null,null,null,null,null,null,null,null,null,null,null,{"$f":"Data!Q23","v":"22.04.2024"}]
[null,null,null,null,null,null,null,null,null,null,null,null,null,{"$f":"'Protocol 1 (5nm)'!N6:BG6","v":"Model"},null,null,null,null,null,null,null,null,null,null,null,null,null,null,null,null,null,null,null,null,null,null,null,null,null,null,null,null,null,null,null,null,null,null,null,null,null,null,null,null,null,null,null,null,null,null,null,null,{"$f":"IF(Data!$AE$2=\"DE\",\"Uhrzeit der Messung:\",IF(Data!$AE$2=\"UK\",\"Time of measurement:\",IF(Data!$AE$2=\"FR\",\"Heure de mesure:\",\"Language Error\")))","v":"Time of measurement:"},null,null,null,null,null,null,null,null,null,null,null,null,null,null,null,null,null,null,null,null,null,{"$f":"Data!Q21","v":"14:26:00"}]
[null,null,null,null,null,null,null,null,null,null,null,null,null,null,null,null,null,null,null,null,null,null,null,null,null,null,null,null,null,null,null,null,null,null,null,null,null,null,null,null,null,null,null,null,null,null,null,null,null,null,null,null,null,null,null,null,null,null,null,null,null,null,{"$f":"IF(Data!$AE$2=\"DE\",\"Referenzdatei:\",IF(Data!$AE$2=\"UK\",\"Reference file:\",IF(Data!$AE$2=\"FR\",\"Fichier de référence:\",\"Language Error\")))","v":"Reference file:"},null,null,null,null,null,null,null,null,null,null,null,null,null,null,null,null,null,null,null,null,null,{"$f":"Data!AC18","v":"M_000002.CSV"}]
[null,null,null,null,null,null,null,null,null,null,null,null,null,null,null,null,null,null,null,null,null,null,null,null,null,null,null,null,null,null,null,null,null,null,null,null,null,null,null,null,null,null,null,null,null,null,null,null,null,null,null,null,null,null,null,null,null,null,null,null,null,null,{"$f":"IF(Data!$AE$2=\"DE\",\"Datum der Messung:\",IF(Data!$AE$2=\"UK\",\"Date of measurement:\",IF(Data!$AE$2=\"FR\",\"Date de mesure:\",\"Language Error\")))","v":"Date of measurement:"},null,null,null,null,null,null,null,null,null,null,null,null,null,null,null,null,null,null,null,null,null,{"$f":"Data!AC23","v":"15.02.2021"}]
[null,null,null,null,null,null,null,null,null,null,null,null,null,null,null,null,null,null,null,null,null,null,null,null,null,null,null,null,null,null,null,null,null,null,null,null,null,null,null,null,null,null,null,null,null,null,null,null,null,null,null,null,null,null,null,null,null,null,null,null,null,null,{"$f":"IF(Data!$AE$2=\"DE\",\"Uhrzeit der Messung:\",IF(Data!$AE$2=\"UK\",\"Time of measurement:\",IF(Data!$AE$2=\"FR\",\"Heure de mesure:\",\"Language Error\")))","v":"Time of measurement:"},null,null,null,null,null,null,null,null,null,null,null,null,null,null,null,null,null,null,null,null,null,{"$f":"Data!AC21","v":"14:02:53"}]
[]
[]
[]
[]
[]
[]
[]
[]
[]
[]
[]
[]
[]
[]
[]
[null,null,null,null,null,null,{"$f":"Data!$AB$18","v":"reference"},null,null,null,null,null,null,null,null,null,{"$f":"Data!$P$18","v":"measurement"},null,null,null,null,null,null,null,null,null,null,null,null,"Δ",null,null,null,null,null,null,null,null,null,null,null,null,null,null,null,null,null,null,null,null,null,null,null,null,null,null,null,null,null,null,null,null,null,null,null,null,{"$f":"Data!$AB$18","v":"reference"},null,null,null,null,null,null,null,null,null,null,null,{"$f":"Data!$P$18","v":"measurement"},null,null,null,null,null,null,null,null,null,null,null,null,"Δ"]
[null,"Ra",null,null,null,null,{"$f":"Data!W1","v":81.760000000000005},null,null,null,null,null,null,null,null,null,{"$f":"Data!K1","v":97.45},null,null,null,null,null,null,null,null,null,null,null,null,{"$f":"Q26-G26","v":15.689999999999998},null,null,null,null,null,null,{"$f":"IF(Data!$AE$2=\"DE\",\"Beleuchtungsstärke\",IF(Data!$AE$2=\"UK\",\"Illuminance\",IF(Data!$AE$2=\"FR\",\"Illuminance\",\"Language Error\")))","v":"Illuminance"},null,null,null,null,null,null,null,null,null,null,null,null,null,null,null,null,null,null,null,null,null,null,null,null,null,null,null,null,null,{"$f":"Data!W33","v":618.98},null,null,null,null,null,null,null,null,null,null,null,{"$f":"Data!K33","v":618.20000000000005},null,null,null,null,null,null,null,null,null,null,null,null,{"$f":"CA26-BO26","v":-0.77999999999997272}]
[null,"R1",null,null,null,null,{"$f":"Data!W2","v":92.13},null,null,null,null,null,null,null,null,null,{"$f":"Data!K2","v":96.71},null,null,null,null,null,null,null,null,null,null,null,null,{"$f":"Q27-G27","v":4.5799999999999983},null,null,null,null,null,null,"Ee",null,null,null,null,null,null,null,null,null,null,null,null,null,null,null,null,null,null,null,null,null,null,null,null,null,null,null,null,null,{"$f":"Data!AC25","v":1.7809999999999999},null,null,null,null,null,null,null,null,null,null,null,{"$f":"Data!Q25","v":2.9710000000000001},null,null,null,null,null,null,null,null,null,null,null,null,{"$f":"CA27-BO27","v":1.1900000000000002}]
[null,"R2",null,null,null,null,{"$f":"Data!W3","v":90.56},null,null,null,null,null,null,null,null,null,{"$f":"Data!K3","v":98.33},null,null,null,null,null,null,null,null,null,null,null,null,7.769999999999996,null,null,null,null,null,null,"LER",null,null,null,null,null,null,null,null,null,null,null,null,null,null,null,null,null,null,null,null,null,null,null,null,null,null,null,null,null,{"$f":"Data!AC26","v":347.5},null,null,null,null,null,null,null,null,null,null,null,{"$f":"Data!Q26","v":208.07808818579605},null,null,null,null,null,null,null,null,null,null,null,null,{"$f":"CA28-BO28","v":-139.42191181420395}]
[null,"R3",null,null,null,null,{"$f":"Data!W4","v":60.36},null,null,null,null,null,null,null,null,null,{"$f":"Data!K4","v":99.17},null,null,null,null,null,null,null,null,null,null,null,null,38.81]
[null,"R4",null,null,null,null,{"$f":"Data!W5","v":87.93},null,null,null,null,null,null,null,null,null,{"$f":"Data!K5","v":96.5},null,null,null,null,null,null,null,null,null,null,null,null,8.5699999999999932,null,null,null,null,null,null,{"$f":"IF(Data!$AE$2 = \"DE\", \"Ähnlichste Farbtemperatur (CCT)\", IF(Data!$AE$2 = \"UK\",\"correlated color temperature (CCT)\",IF(Data!$AE$2=\"FR\",\"temp. de couleur proximale (CCT)\",\"Language Error\")))","v":"correlated color temperature (CCT)"},null,null,null,null,null,null,null,null,null,null,null,null,null,null,null,null,null,null,null,null,null,null,null,null,null,null,null,null,null,{"$f":"Data!W30","v":3865},null,null,null,null,null,null,null,null,null,null,null,{"$f":"Data!K30","v":6137},null,null,null,null,null,null,null,null,null,null,null,null,{"$f":"CA30-BO30","v":2272}]
[null,"R5",null,null,null,null,{"$f":"Data!W6","v":82.79},null,null,null,null,null,null,null,null,null,{"$f":"Data!K6","v":96.93},null,null,null,null,null,null,null,null,null,null,null,null,14.14,null,null,null,null,null,null,"Duv",null,null,null,null,null,null,null,null,null,null,null,null,null,null,null,null,null,null,null,null,null,null,null,null,null,null,null,null,null,{"$f":"Data!W31","v":7.4000000000000003E-3},null,null,null,null,null,null,null,null,null,null,null,{"$f":"Data!K31","v":5.8999999999999999E-3},null,null,null,null,null,null,null,null,null,null,null,null,{"$f":"CA31-BO31","v":-1.5000000000000005E-3}]
[null,"R6",null,null,null,null,{"$f":"Data!W7","v":77.28},null,null,null,null,null,null,null,null,null,{"$f":"Data!K7","v":98.08},null,null,null,null,null,null,null,null,null,null,null,null,20.799999999999997]
[null,"R7",null,null,null,null,{"$f":"Data!W8","v":91.05},null,null,null,null,null,null,null,null,null,{"$f":"Data!K8","v":98.45},null,null,null,null,null,null,null,null,null,null,null,null,7.4000000000000057,null,null,null,null,null,null,{"$f":"IF(Data!$AE$2 = \"DE\", \"Farbreinheit\",IF(Data!$AE$2 = \"UK\",\"Saturation\",IF(Data!$AE$2=\"FR\",\"Saturation\",\"Language Error\")))","v":"Saturation"},null,null,null,null,null,null,null,null,null,null,null,null,null,null,null,null,null,null,null,null,null,null,null,null,null,null,null,null,null,{"$f":"Data!W39/100","v":0.38},null,null,null,null,null,null,null,null,null,null,null,{"$f":"Data!K39/100","v":4.5999999999999999E-2},null,null,null,null,null,null,null,null,null,null,null,null,{"$f":"CA33-BO33","v":-0.33400000000000002}]
[null,"R8",null,null,null,null,{"$f":"Data!W9","v":71.98},null,null,null,null,null,null,null,null,null,{"$f":"Data!K9","v":95.4},null,null,null,null,null,null,null,null,null,null,null,null,23.42]
[null,"R9",null,null,null,null,{"$f":"Data!W10","v":7.09},null,null,null,null,null,null,null,null,null,{"$f":"Data!K10","v":86.96},null,null,null,null,null,null,null,null,null,null,null,null,79.86999999999999,null,null,null,null,null,null,{"$f":"IF(Data!$AE$2 = \"DE\", \"Dominante Wellenlänge\", IF(Data!$AE$2 = \"UK\", \"Dominant wavelength\",IF(Data!$AE$2=\"FR\",\"Longueur d'onde dominante (λD)\",\"Language Error\")))","v":"Dominant wavelength"},null,null,null,null,null,null,null,null,null,null,null,null,null,null,null,null,null,null,null,null,null,null,null,null,null,null,null,null,null,{"$f":"Data!W40","v":576},null,null,null,null,null,null,null,null,null,null,null,{"$f":"Data!K40","v":495},null,null,null,null,null,null,null,null,null,null,null,null,{"$f":"CA35-BO35","v":-81}]
[null,"R10",null,null,null,null,{"$f":"Data!W11","v":48.9},null,null,null,null,null,null,null,null,null,{"$f":"Data!K11","v":96.71},null,null,null,null,null,null,null,null,null,null,null,null,47.809999999999995,null,null,null,null,null,null,{"$f":"IF(Data!$AE$2 = \"DE\", \"Peak-Wellenlänge\",IF(Data!$AE$2 = \"UK\", \"Peak wavelength\",IF(Data!$AE$2=\"FR\",\"Pic courbe spectrale (λP)\",\"Language Error\")))","v":"Peak wavelength"},null,null,null,null,null,null,null,null,null,null,null,null,null,null,null,null,null,null,null,null,null,null,null,null,null,null,null,null,null,{"$f":"Data!W20","v":544},null,null,null,null,null,null,null,null,null,null,null,{"$f":"Data!K20","v":459},null,null,null,null,null,null,null,null,null,null,null,null,{"$f":"CA36-BO36","v":-85}]
[null,"R11",null,null,null,null,{"$f":"Data!W12","v":70.989999999999995},null,null,null,null,null,null,null,null,null,{"$f":"Data!K12","v":96.02},null,null,null,null,null,null,null,null,null,null,null,null,25.03]
[null,"R12",null,null,null,null,{"$f":"Data!W13","v":53.37},null,null,null,null,null,null,null,null,null,{"$f":"Data!K13","v":96.51},null,null,null,null,null,null,null,null,null,null,null,null,43.140000000000008,null,null,null,null,null,null,"TM30 Rf",null,null,null,null,null,null,null,null,null,null,null,null,null,null,null,null,null,null,null,null,null,null,null,null,null,null,null,null,null,{"$f":"Data!W43","v":80.7},null,null,null,null,null,null,null,null,null,null,null,{"$f":"Data!K43","v":0},null,null,null,null,null,null,null,null,null,null,null,null,{"$f":"CA38-BO38","v":-80.7}]
[null,"R13",null,null,null,null,{"$f":"Data!W14","v":93.49},null,null,null,null,null,null,null,null,null,{"$f":"Data!K14","v":97.05},null,null,null,null,null,null,null,null,null,null,null,null,3.5600000000000023,null,null,null,null,null,null,"TM30 Rg",null,null,null,null,null,null,null,null,null,null,null,null,null,null,null,null,null,null,null,null,null,null,null,null,null,null,null,null,null,{"$f":"Data!W44","v":97.1},null,null,null,null,null,null,null,null,null,null,null,{"$f":"Data!K44","v":0},null,null,null,null,null,null,null,null,null,null,null,null,{"$f":"CA39-BO39","v":-97.1}]
[null,"R14",null,null,null,null,{"$f":"Data!W15","v":73.55},null,null,null,null,null,null,null,null,null,{"$f":"Data!K15","v":99.3},null,null,null,null,null,null,null,null,null,null,null,null,25.75]
[null,"R15",null,null,null,null,{"$f":"Data!W16","v":89.59},null,null,null,null,null,null,null,null,null,{"$f":"Data!K16","v":95.47},null,null,null,null,null,null,null,null,null,null,null,null,5.8799999999999955,null,null,null,null,null,null,"PPFD [µmol/m²s]",null,null,null,null,null,null,null,null,null,null,null,null,null,null,null,null,null,null,null,null,null,null,null,null,null,null,null,null,null,{"$f":"Data!W142","v":7.87},null,null,null,null,null,null,null,null,null,null,null,{"$f":"Data!K142","v":10.76},null,null,null,null,null,null,null,null,null,null,null,null,{"$f":"CA41-BO41","v":2.8899999999999997}]
[null,null,null,null,null,null,null,null,null,null,null,null,null,null,null,null,null,null,null,null,null,null,null,null,null,null,null,null,null,null,null,null,null,null,null,null,"PPFD UV [µmol/m²s]",null,null,null,null,null,null,null,null,null,null,null,null,null,null,null,null,null,null,null,null,null,null,null,null,null,null,null,null,null,{"$f":"Data!W143","v":0.03},null,null,null,null,null,null,null,null,null,null,null,{"$f":"Data!K143","v":0.2},null,null,null,null,null,null,null,null,null,null,null,null,0.17]
[null,"Re",null,null,null,null,{"$f":"Data!AC27","v":72.739999999999995},null,null,null,null,null,null,null,null,null,{"$f":"Data!Q27","v":96.51},null,null,null,null,null,null,null,null,null,null,null,null,{"$f":"Q43-G43","v":23.77000000000001},null,null,null,null,null,null,{"$f":"IF(Data!$AE$2 = \"DE\", \"PPFD Blau\",IF(Data!$AE$2 = \"UK\",\"PPFD Blue\",IF(Data!$AE$2=\"FR\",\"PPFD Bleu\",\"Language Error\"))) & \" [µmol/m²s]\"","v":"PPFD Blue [µmol/m²s]"},null,null,null,null,null,null,null,null,null,null,null,null,null,null,null,null,null,null,null,null,null,null,null,null,null,null,null,null,null,{"$f":"Data!W145","v":1.6},null,null,null,null,null,null,null,null,null,null,null,{"$f":"Data!K145","v":3.09},null,null,null,null,null,null,null,null,null,null,null,null,1.4899999999999998]
[null,"GAI",null,null,null,null,{"$f":"Data!AC28","v":614.86400000000003},null,null,null,null,null,null,null,null,null,{"$f":"Data!Q28","v":732},null,null,null,null,null,null,null,null,null,null,null,null,{"$f":"Q44-G44","v":117.13599999999997},null,null,null,null,null,null,{"$f":"IF(Data!$AE$2 = \"DE\", \"PPFD Grün\",IF(Data!$AE$2 = \"UK\",\"PPFD Green\",IF(Data!$AE$2=\"FR\",\"PPFD Vert\",\"Language Error\"))) & \" [µmol/m²s]\"","v":"PPFD Green [µmol/m²s]"},null,null,null,null,null,null,null,null,null,null,null,null,null,null,null,null,null,null,null,null,null,null,null,null,null,null,null,null,null,{"$f":"Data!W147","v":3.44},null,null,null,null,null,null,null,null,null,null,null,{"$f":"Data!K147","v":3.97},null,null,null,null,null,null,null,null,null,null,null,null,0.53000000000000025]
[null,null,null,null,null,null,null,null,null,null,null,null,null,null,null,null,null,null,null,null,null,null,null,null,null,null,null,null,null,null,null,null,null,null,null,null,{"$f":"IF(Data!$AE$2 = \"DE\", \"PPFD Rot\",IF(Data!$AE$2 = \"UK\",\"PPFD Red\",IF(Data!$AE$2=\"FR\",\"PPFD Rouge\",\"Language Error\"))) & \" [µmol/m²s]\"","v":"PPFD Red [µmol/m²s]"},null,null,null,null,null,null,null,null,null,null,null,null,null,null,null,null,null,null,null,null,null,null,null,null,null,null,null,null,null,{"$f":"Data!W149","v":2.83},null,null,null,null,null,null,null,null,null,null,null,{"$f":"Data!K149","v":3.7},null,null,null,null,null,null,null,null,null,null,null,null,0.87000000000000011]
[null,"TLCI",null,null,null,null,{"$f":"Data!AC30","v":59},null,null,null,null,null,null,null,null,null,{"$f":"Data!Q30","v":100},null,null,null,null,null,null,null,null,null,null,null,null,{"$f":"Q46-G46","v":41},null,null,null,null,null,null,"PPFD FR [µmol/m²s]",null,null,null,null,null,null,null,null,null,null,null,null,null,null,null,null,null,null,null,null,null,null,null,null,null,null,null,null,null,{"$f":"Data!W150","v":0.46},null,null,null,null,null,null,null,null,null,null,null,{"$f":"Data!K150","v":3.26},null,null,null,null,null,null,null,null,null,null,null,null,2.8]
[]
[]
[]
[]
[{"$f":"'Protocol 1 (5nm)'!A54:AA54","v":"Company"}]
[{"$f":"'Protocol 1 (5nm)'!A55:AA55","v":"Address"}]
[{"$f":"'Protocol 1 (5nm)'!A56:AA56","v":"ZIP  City"}]
[]
[{"$f":"'Protocol 1 (5nm)'!A58:O58","v":"Test location,"},null,null,null,null,null,null,null,null,null,null,null,null,null,null,{"$f":"'Protocol 1 (5nm)'!P58:AA58","v":"Date"},null,null,null,null,null,null,null,null,null,null,null,null,null,null,null,null,null,null,null,null,null,null,null,null,null,null,null,null,null,null,null,null,null,null,null,null,null,null,null,null,null,null,null,null,null,null,null,{"$f":"'Protocol 1 (5nm)'!BL58:CF58","v":"First, last name of inspector"},null,null,null,null,null,null,null,null,null,null,null,null,null,null,null,null,null,null,null,null,{"$f":"'Protocol 1 (5nm)'!CG58:CX58","v":"Phone number"}]

{"sheet":"Data","index":7,"n_rows":800,"n_cols":40,"rows_kept":800,"cut":false,"hidden":false,"merged":[]}
["Seriennummer","21C10666","Seriennummer","18C10567",null,1,{"$f":"IF(INDEX($A$1:$A$500,MATCH(\"Spe*\",$A$1:$A$500,0)+F1)=0,\"\",INDEX($A$1:$A$500,MATCH(\"Spe*\",$A$1:$A$500,0)+F1))","v":380},{"$f":"IF(INDEX($A$1:$A$500,MATCH(\"Spe*\",$A$1:$A$500,0)+F1)=0,\"\",INDEX($B$1:$B$500,MATCH(\"Spe*\",$A$1:$A$500,0)+F1))","v":2.2667820000000001},"CRI","Ra",{"$f":"IF(ISNA(MATCH(I1,$A$1:$A$300,0)),IF($A$1=\"\",NA(),INDEX($B$1:$B$300,MATCH(J1,$A$1:$A$300,0))),IF($A$1=\"\",NA(),INDEX($B$1:$B$300,MATCH(I1,$A$1:$A$300,0))))","v":97.45},{"$f":"IF(K1=\"\",NA(),IF(K1 < 0, 0, K1))","v":97.45},{"$f":"IF(G1=\"\",NA(),ROUND(G1,0))","v":380},{"$f":"IF(H1=\"\",NA(),H1)","v":2.2667820000000001},null,"R15",{"$f":"IF($A$1=\"\",NA(),INDEX($B$1:$B$300,MATCH(P1,$A$1:$A$300,0)))","v":95.47},1,{"$f":"IF(INDEX($C$1:$C$500,MATCH(\"Spe*\",$C$1:$C$500,0)+R1)=0,\"\",INDEX($C$1:$C$500,MATCH(\"Spe*\",$C$1:$C$500,0)+R1))","v":380},{"$f":"IF(INDEX($C$1:$C$500,MATCH(\"Spe*\",$C$1:$C$500,0)+R1)=0,\"\",INDEX($D$1:$D$500,MATCH(\"Spe*\",$C$1:$C$500,0)+R1))","v":0.16852},"CRI","Ra",{"$f":"IF(ISNA(MATCH(U1,$C$1:$C$300,0)),IF($C$1=\"\",NA(),INDEX($D$1:$D$300,MATCH(V1,$C$1:$C$300,0))),IF($C$1=\"\",NA(),INDEX($D$1:$D$300,MATCH(U1,$C$1:$C$300,0))))","v":81.760000000000005},null,{"$f":"IF(S1=\"\",NA(),ROUND(S1,0))","v":380},{"$f":"IF(T1=\"\",NA(),T1)","v":0.16852},null,"R15",{"$f":"IF($C$1=\"\",NA(),INDEX($D$1:$D$300,MATCH(AB1,$C$1:$C$300,0)))","v":89.59},null,null,null,"u","v","u'","v'","x","y",null,"Seriennummer"]
["Software Rev.","1.3.4","Software Rev.","1.3.0",null,{"$f":"F1+1","v":2},{"$f":"IF(INDEX($A$1:$A$500,MATCH(\"Spe*\",$A$1:$A$500,0)+F2)=0,\"\",INDEX($A$1:$A$500,MATCH(\"Spe*\",$A$1:$A$500,0)+F2))","v":385},{"$f":"IF(INDEX($A$1:$A$500,MATCH(\"Spe*\",$A$1:$A$500,0)+F2)=0,\"\",INDEX($B$1:$B$500,MATCH(\"Spe*\",$A$1:$A$500,0)+F2))","v":2.4779659999999999},null,"R1",{"$f":"IF($A$1=\"\",NA(),INDEX($B$1:$B$300,MATCH(J2,$A$1:$A$300,0)))","v":96.71},{"$f":"IF(K2=\"\",NA(),IF(K2 < 0, 0, K2))","v":96.71},385,{"$f":"IF(H2=\"\",NA(),H2)","v":2.4779659999999999},null,"R14",99.3,{"$f":"R1+1","v":2},{"$f":"IF(INDEX($C$1:$C$500,MATCH(\"Spe*\",$C$1:$C$500,0)+R2)=0,\"\",INDEX($C$1:$C$500,MATCH(\"Spe*\",$C$1:$C$500,0)+R2))","v":385},{"$f":"IF(INDEX($C$1:$C$500,MATCH(\"Spe*\",$C$1:$C$500,0)+R2)=0,\"\",INDEX($D$1:$D$500,MATCH(\"Spe*\",$C$1:$C$500,0)+R2))","v":8.1559999999999994E-2},null,"R1",{"$f":"IF($C$1=\"\",NA(),INDEX($D$1:$D$300,MATCH(V2,$C$1:$C$300,0)))","v":92.13},null,385,{"$f":"IF(T2=\"\",NA(),T2)","v":8.1559999999999994E-2},null,"R14",73.55,null,"UK",null,0.18006,0.26351999999999998,{"$f":"AG2","v":0.18006},{"$f":"AH2*1.5","v":0.39527999999999996},{"$f":"(9*AG2)/(6*AG2-16*AJ2+12)","v":0.23987104566688575},{"$f":"(4*AJ2)/(6*AG2-16*AJ2+12)","v":0.23403612852803776},null,"Software Rev."]
["Zeit","14:26:00","Zeit","14:02:53",null,{"$f":"F2+1","v":3},390,2.8305609999999999,null,"R2",98.33,98.33,390,2.8305609999999999,null,"R13",97.05,{"$f":"R2+1","v":3},390,0.13952999999999999,null,"R2",90.56,null,390,0.13952999999999999,null,"R13",93.49,null,null,null,0.18065999999999999,0.26589000000000002,{"$f":"AG3","v":0.18065999999999999},{"$f":"AH3*1.5","v":0.39883500000000005},{"$f":"(9*AG3)/(6*AG3-16*AJ3+12)","v":0.24258347506937611},{"$f":"(4*AJ3)/(6*AG3-16*AJ3+12)","v":0.23801808253513571},null,"Zeit"]
["Datum","22.04.2024","Datum","15.02.2021",null,4,395,3.3971849999999999,null,"R3",99.17,99.17,395,3.3971849999999999,null,"R12",96.51,4,395,0.22821,null,"R3",60.36,null,395,0.22821,null,"R12",53.37,null,null,null,0.18132999999999999,0.26845999999999998,0.18132999999999999,0.40268999999999999,0.24559589702841558,0.24240399461846157,null,"Datum"]
[null,null,null,null,null,5,{"$f":"IF(G4=\"\",\"\",IF(INDEX($A$1:$A$500,MATCH(\"Spe*\",$A$1:$A$500,0)+F5)=0,\"\",INDEX($A$1:$A$500,MATCH(\"Spe*\",$A$1:$A$500,0)+F5)))","v":400},{"$f":"IF(H4=\"\",\"\",IF(INDEX($A$1:$A$500,MATCH(\"Spe*\",$A$1:$A$500,0)+F5)=0,\"\",INDEX($B$1:$B$500,MATCH(\"Spe*\",$A$1:$A$500,0)+F5)))","v":4.636063},null,"R4",96.5,96.5,400,4.636063,null,"R11",96.02,5,{"$f":"IF(S4=\"\",\"\",IF(INDEX($C$1:$C$500,MATCH(\"Spe*\",$C$1:$C$500,0)+R5)=0,\"\",INDEX($C$1:$C$500,MATCH(\"Spe*\",$C$1:$C$500,0)+R5)))","v":400},{"$f":"IF(T4=\"\",\"\",IF(INDEX($C$1:$C$500,MATCH(\"Spe*\",$C$1:$C$500,0)+R5)=0,\"\",INDEX($D$1:$D$500,MATCH(\"Spe*\",$C$1:$C$500,0)+R5)))","v":1.38337},null,"R4",87.93,null,400,1.38337,null,"R11",70.989999999999995,null,null,null,0.18207999999999999,0.27118999999999999,0.18207999999999999,0.40678499999999995,0.24889731345459842,0.24713848284912326]
["Integrationszeit [ms]",2352,"Integrationszeit [ms]",947,null,6,{"$f":"IF(G5=\"\",\"\",IF(INDEX($A$1:$A$500,MATCH(\"Spe*\",$A$1:$A$500,0)+F6)=0,\"\",INDEX($A$1:$A$500,MATCH(\"Spe*\",$A$1:$A$500,0)+F6)))","v":405},{"$f":"IF(H5=\"\",\"\",IF(INDEX($A$1:$A$500,MATCH(\"Spe*\",$A$1:$A$500,0)+F6)=0,\"\",INDEX($B$1:$B$500,MATCH(\"Spe*\",$A$1:$A$500,0)+F6)))","v":5.7536860000000001},null,"R5",96.93,96.93,405,5.7536860000000001,null,"R10",96.71,6,{"$f":"IF(S5=\"\",\"\",IF(INDEX($C$1:$C$500,MATCH(\"Spe*\",$C$1:$C$500,0)+R6)=0,\"\",INDEX($C$1:$C$500,MATCH(\"Spe*\",$C$1:$C$500,0)+R6)))","v":405},{"$f":"IF(T5=\"\",\"\",IF(INDEX($C$1:$C$500,MATCH(\"Spe*\",$C$1:$C$500,0)+R6)=0,\"\",INDEX($D$1:$D$500,MATCH(\"Spe*\",$C$1:$C$500,0)+R6)))","v":2.7577099999999999},null,"R5",82.79,null,405,2.7577099999999999,null,"R10",48.9,null,null,null,0.18293000000000001,0.27406999999999998,0.18293000000000001,0.41110499999999994,0.25251460911977175,0.25221552477798731,null,"Integrationszeit [ms]"]
["E vis [lx]",618.20000000000005,"E vis [lx]",618.98,null,7,410,6.132161,null,"R6",98.08,98.08,410,6.132161,null,"R9",86.96,7,410,1.68282,null,"R6",77.28,null,410,1.68282,null,"R9",7.09,null,null,null,0.18387999999999999,0.27709,0.18387999999999999,0.41563499999999998,0.25645269265099674,0.25763351681047303,null,"E vis [lx]"]
["Ee [W/m²]",2.9710000000000001,"Ee [W/m²]",1.7809999999999999,null,8,415,6.7396719999999997,null,"R7",98.45,98.45,415,6.7396719999999997,null,"R8",95.4,8,415,0.97008000000000005,null,"R7",91.05,null,415,0.97008000000000005,null,"R8",71.98,null,null,null,0.18493999999999999,0.28021000000000001,0.18493999999999999,0.42031499999999999,0.26069918240766848,0.26333051404943147,null,"Ee [W/m²]"]
["LER [lm/W]",208.07808818579605,"LER [lm/W]",347.5,null,9,420,6.9245169999999998,null,"R8",95.4,95.4,420,6.9245169999999998,null,"R7",98.45,9,420,1.27929,null,"R8",71.98,null,420,1.27929,null,"R7",91.05,null,null,null,0.18611,0.28342000000000001,0.18611,0.42513000000000001,0.26525754682021607,0.2693005710593579,null,"LER [lm/W]"]
["CCT [K]",6137,"CCT [K]",3865,null,10,425,6.8936270000000004,null,"R9",86.96,86.96,425,6.8936270000000004,null,"R6",98.08,10,425,1.76498,null,"R9",7.09,null,425,1.76498,null,"R6",77.28,null,null,null,0.18740000000000001,0.28667999999999999,0.18740000000000001,0.43001999999999996,0.27011184994426723,0.27547372871583958,null,"CCT [K]"]
["Duv",5.8999999999999999E-3,"Duv",7.4000000000000003E-3,null,11,430,6.7464190000000004,null,"R10",96.71,96.71,430,6.7464190000000004,null,"R5",96.93,11,430,4.5263799999999996,null,"R10",48.9,null,430,4.5263799999999996,null,"R5",82.79,null,null,null,0.1888,0.28997000000000001,0.1888,0.43495499999999998,0.27524005753605724,0.28181977218831394,null,"Duv"]
["TM30 Rf",0,"TM30 Rf",80.7,null,12,435,7.1653640000000003,null,"R11",96.02,96.02,435,7.1653640000000003,null,"R4",96.5,12,435,10.789669999999999,null,"R11",70.989999999999995,null,435,10.789669999999999,null,"R4",87.93,null,null,null,0.19031999999999999,0.29326000000000002,0.19031999999999999,0.43989,0.28063070147845237,0.28827854671280279,null,"TM30 Rf"]
["TM30 Rg",0,"TM30 Rg",97.1,null,13,440,7.857132,null,"R12",96.51,96.51,440,7.857132,null,"R3",99.17,13,440,8.2623499999999996,null,"R12",53.37,null,440,8.2623499999999996,null,"R3",60.36,null,null,null,0.19461999999999999,0.30141000000000001,0.19461999999999999,0.45211500000000004,0.29518291573135957,0.3047685494145484,null,"TM30 Rg"]
["R-Bin01 a",0,"R-Bin01 a",0.97269799999999995,null,14,445,8.4695160000000005,null,"R13",97.05,97.05,445,8.4695160000000005,null,"R2",98.33,14,445,3.3389000000000002,null,"R13",93.49,null,445,3.3389000000000002,null,"R2",90.56,null,null,null,0.19961999999999999,0.30920999999999998,0.19961999999999999,0.46381499999999998,0.3110056295311493,0.32116371341324079,null,"R-Bin01 a"]
["R-Bin01 b",0,"R-Bin01 b",0.232073,null,15,450,9.0620759999999994,null,"R14",99.3,99.3,450,9.0620759999999994,null,"R1",96.71,15,450,3.2912599999999999,null,"R14",73.55,null,450,3.2912599999999999,null,"R1",92.13,null,null,null,0.20524999999999999,0.31646999999999997,0.20524999999999999,0.47470499999999993,0.32774625546909086,0.33689600476915366,null,"R-Bin01 b"]
["R-Bin02 a",0,"R-Bin02 a",0.81894100000000003,null,16,455,9.3851980000000008,null,"R15",95.47,95.47,455,9.3851980000000008,"CRI","Ra",{"$f":"IF(ISNA(MATCH(O16,$A$1:$A$300,0)),IF($A$1=\"\",NA(),INDEX($B$1:$B$300,MATCH(P16,$A$1:$A$300,0))),IF($A$1=\"\",NA(),INDEX($B$1:$B$300,MATCH(O16,$A$1:$A$300,0))))","v":97.45},16,455,3.2295199999999999,null,"R15",89.59,null,455,3.2295199999999999,"CRI","Ra",{"$f":"IF(ISNA(MATCH(AA16,$C$1:$C$300,0)),IF($C$1=\"\",NA(),INDEX($D$1:$D$300,MATCH(AB16,$C$1:$C$300,0))),IF($C$1=\"\",NA(),INDEX($D$1:$D$300,MATCH(AA16,$C$1:$C$300,0))))","v":81.760000000000005},null,null,null,0.21142,0.32312000000000002,0.21142,0.48468,0.34510414172851323,0.35162252160097501,null,"R-Bin02 a"]
["R-Bin02 b",0,"R-Bin02 b",0.573878,null,17,460,9.541563,null,"Integrationtime [ms]",null,null,460,9.541563,null,null,null,17,460,3.1371699999999998,null,"Integrationtime [ms]",null,null,460,3.1371699999999998,null,null,null,null,null,null,0.21807000000000001,0.32908999999999999,0.21807000000000001,0.49363499999999999,0.36276075456632401,0.36496212751328033,null,"R-Bin02 b"]
["R-Bin03 a",0,"R-Bin03 a",0.55005899999999996,null,18,465,9.4470469999999995,null,"Integrationszeit [ms]",{"$f":"IF(ISNA(MATCH(J17,$A$1:$A$300,0)),IF($A$1=\"\",NA(),INDEX($B$1:$B$300,MATCH(J18,$A$1:$A$300,0))),IF($A$1=\"\",NA(),INDEX($B$1:$B$300,MATCH(J17,$A$1:$A$300,0))))","v":2352},null,465,9.4470469999999995,null,"measurement","Measured",18,465,2.9052099999999998,null,"Integrationszeit [ms]",{"$f":"IF(ISNA(MATCH(V17,$C$1:$C$300,0)),IF($C$1=\"\",NA(),INDEX($D$1:$D$300,MATCH(V18,$C$1:$C$300,0))),IF($C$1=\"\",NA(),INDEX($D$1:$D$300,MATCH(V17,$C$1:$C$300,0))))","v":947},null,465,2.9052099999999998,null,"reference","M_000002.CSV",null,null,null,0.22511,0.33439000000000002,0.22511,0.50158500000000006,0.38044617204664538,0.37675623908512212,null,"R-Bin03 a"]
["R-Bin03 b",0,"R-Bin03 b",0.83512600000000003,null,19,470,9.3762030000000003,null,null,null,null,470,9.3762030000000003,null,null,null,19,470,2.7472099999999999,null,null,null,null,470,2.7472099999999999,null,null,null,null,null,null,0.23247000000000001,0.33904000000000001,0.23247000000000001,0.50856000000000001,0.39792425055060426,0.38689504855587636,null,"R-Bin03 b"]
["R-Bin04 a",0,"R-Bin04 a",0.166876,null,20,475,9.4019049999999993,null,"Lambda Peak [nm]",{"$f":"IF($A$1=\"\",NA(),INDEX($B$1:$B$300,MATCH(J20,$A$1:$A$300,0)))","v":459},null,475,9.4019049999999993,null,"Time",null,20,475,2.6691099999999999,null,"Lambda Peak [nm]",{"$f":"IF($C$1=\"\",NA(),INDEX($D$1:$D$300,MATCH(V20,$C$1:$C$300,0)))","v":544},null,475,2.6691099999999999,null,"Time",null,null,null,null,0.24010000000000001,0.34308,0.24010000000000001,0.51461999999999997,0.41502454539168915,0.39535366106616876,null,"R-Bin04 a"]
["R-Bin04 b",0,"R-Bin04 b",0.98597800000000002,null,21,480,9.3887429999999998,null,"Lambda Peak",{"$f":"IF($A$1=\"\",NA(),INDEX($B$1:$B$300,MATCH(J21,$A$1:$A$300,0)))","v":9.5434199999999993},null,480,9.3887429999999998,null,"Zeit",{"$f":"IF(ISNA(MATCH(P20,$A$1:$A$300,0)),IF($A$1=\"\",NA(),INDEX($B$1:$B$300,MATCH(P21,$A$1:$A$300,0))),IF($A$1=\"\",NA(),INDEX($B$1:$B$300,MATCH(P20,$A$1:$A$300,0))))","v":"14:26:00"},21,480,3.9504299999999999,null,"Lambda Peak",{"$f":"IF($C$1=\"\",NA(),INDEX($D$1:$D$300,MATCH(V21,$C$1:$C$300,0)))","v":33.226990000000001},null,480,3.9504299999999999,null,"Zeit",{"$f":"IF(ISNA(MATCH(AB20,$C$1:$C$300,0)),IF($C$1=\"\",NA(),INDEX($D$1:$D$300,MATCH(AB21,$C$1:$C$300,0))),IF($C$1=\"\",NA(),INDEX($D$1:$D$300,MATCH(AB20,$C$1:$C$300,0))))","v":"14:02:53"},null,null,null,0.24701999999999999,0.34655000000000002,0.24701999999999999,0.51982499999999998,0.43043841918171039,0.40258125972909548,null,"R-Bin04 b"]
["R-Bin05 a",0,"R-Bin05 a",-0.11511399999999999,null,22,485,9.1542910000000006,null,null,null,null,485,9.1542910000000006,null,"Date",null,22,485,7.5335799999999997,null,null,null,null,485,7.5335799999999997,null,"Date",null,null,null,null,0.25591000000000003,0.34950999999999999,0.25591000000000003,0.52426499999999998,0.44746290230454494,0.40741604205765436,null,"R-Bin05 a"]
["R-Bin05 b",0,"R-Bin05 b",0.99335200000000001,null,23,490,9.0290510000000008,null,"x",{"$f":"IF($A$1=\"\",NA(),INDEX($B$1:$B$300,MATCH(J23,$A$1:$A$300,0)))","v":0.31859999999999999},null,490,9.0290510000000008,null,"Datum",{"$f":"IF(ISNA(MATCH(P22,$A$1:$A$300,0)),IF($A$1=\"\",NA(),INDEX($B$1:$B$300,MATCH(P23,$A$1:$A$300,0))),IF($A$1=\"\",NA(),INDEX($B$1:$B$300,MATCH(P22,$A$1:$A$300,0))))","v":"22.04.2024"},23,490,8.9959799999999994,null,"x",{"$f":"IF($C$1=\"\",NA(),INDEX($D$1:$D$300,MATCH(V23,$C$1:$C$300,0)))","v":0.3926},null,490,8.9959799999999994,null,"Datum",{"$f":"IF(ISNA(MATCH(AB22,$C$1:$C$300,0)),IF($C$1=\"\",NA(),INDEX($D$1:$D$300,MATCH(AB23,$C$1:$C$300,0))),IF($C$1=\"\",NA(),INDEX($D$1:$D$300,MATCH(AB22,$C$1:$C$300,0))))","v":"15.02.2021"},null,null,null,0.26400000000000001,0.35199999999999998,0.26400000000000001,0.52800000000000002,0.46261682242990665,0.41121495327102814,null,"R-Bin05 b"]
["R-Bin06 a",0,"R-Bin06 a",-0.55029300000000003,null,24,495,9.1911369999999994,null,"y",0.34010000000000001,null,495,9.1911369999999994,null,"Ee [W/m2]",null,24,495,6.7081299999999997,null,"y",0.40060000000000001,null,495,6.7081299999999997,null,"Ee [W/m≤]",null,null,null,null,0.27217999999999998,0.35407,0.27217999999999998,0.53110499999999994,0.47700665965650185,0.4136815048486972,null,"R-Bin06 a"]
["R-Bin06 b",0,"R-Bin06 b",0.83497200000000005,null,25,500,9.1107759999999995,null,"u'",0.1978,null,500,9.1107759999999995,null,"Ee [W/m²]",{"$f":"IF(ISNA(MATCH(P24,$A$1:$A$300,0)),IF($A$1=\"\",NA(),INDEX($B$1:$B$300,MATCH(P25,$A$1:$A$300,0))),IF($A$1=\"\",NA(),INDEX($B$1:$B$300,MATCH(P24,$A$1:$A$300,0))))","v":2.9710000000000001},25,500,3.7833800000000002,null,"u'",0.22359999999999999,null,500,3.7833800000000002,null,"Ee [W/m²]",{"$f":"IF(ISNA(MATCH(AB24,$C$1:$C$300,0)),IF($C$1=\"\",NA(),INDEX($D$1:$D$300,MATCH(AB25,$C$1:$C$300,0))),IF($C$1=\"\",NA(),INDEX($D$1:$D$300,MATCH(AB24,$C$1:$C$300,0))))","v":1.7809999999999999},null,null,null,0.28038999999999997,0.35576999999999998,0.28038999999999997,0.53365499999999999,0.49058683556706439,0.41498407810476956,null,"R-Bin06 b"]
["R-Bin07 a",0,"R-Bin07 a",-0.85750700000000002,null,26,505,9.1073210000000007,null,"v'",0.47499999999999998,null,505,9.1073210000000007,null,"LER [lm/W]",{"$f":"IF($A$1=\"\",NA(),INDEX($B$1:$B$300,MATCH(P26,$A$1:$A$300,0)))","v":208.07808818579605},26,505,2.0131100000000002,null,"v'",0.51339999999999997,null,505,2.0131100000000002,null,"LER [lm/W]",{"$f":"IF($C$1=\"\",NA(),INDEX($D$1:$D$300,MATCH(AB26,$C$1:$C$300,0)))","v":347.5},null,null,null,0.28863,0.35714000000000001,0.28863,0.53571000000000002,0.503383445533503,0.41524527073377748,null,"R-Bin07 a"]
["R-Bin07 b",0,"R-Bin07 b",0.51447299999999996,null,27,510,9.0491340000000005,null,"u",0.1978,null,510,9.0491340000000005,null,"Re",{"$f":"IF($A$1=\"\",NA(),INDEX($B$1:$B$300,MATCH(P27,$A$1:$A$300,0)))","v":96.51},27,510,1.4522600000000001,null,"u",0.22359999999999999,null,510,1.4522600000000001,null,"Re",{"$f":"IF($C$1=\"\",NA(),INDEX($D$1:$D$300,MATCH(AB27,$C$1:$C$300,0)))","v":72.739999999999995},null,null,null,0.29685,0.35822999999999999,0.29685,0.53734499999999996,0.51540634079149927,0.41465165001794119,null,"R-Bin07 b"]
["R-Bin08 a",0,"R-Bin08 a",-0.99007599999999996,null,28,515,8.8924649999999996,null,"v",0.31669999999999998,null,515,8.8924649999999996,null,"GAI",{"$f":"IF(ISNA(MATCH(O28,$A$1:$A$300,0)),IF($A$1=\"\",NA(),INDEX($B$1:$B$300,MATCH(P28,$A$1:$A$300,0))),IF($A$1=\"\",NA(),INDEX($B$1:$B$300,MATCH(O28,$A$1:$A$300,0))))","v":732},28,515,1.3143800000000001,null,"v",0.34229999999999999,null,515,1.3143800000000001,null,"GAI",{"$f":"IF(ISNA(MATCH(AA28,$C$1:$C$300,0)),IF($C$1=\"\",NA(),INDEX($D$1:$D$300,MATCH(AB28,$C$1:$C$300,0))),IF($C$1=\"\",NA(),INDEX($D$1:$D$300,MATCH(AA28,$C$1:$C$300,0))))","v":614.86400000000003},null,null,null,0.30504999999999999,0.35907,0.30504999999999999,0.538605,0.52669291066680479,0.41330847059636044,null,"R-Bin08 a"]
["R-Bin08 b",0,"R-Bin08 b",0.14052999999999999,null,29,520,8.797625,null,null,null,null,520,8.797625,null,null,null,29,520,1.2144600000000001,null,null,null,null,520,1.2144600000000001,null,null,null,null,null,null,0.31319999999999998,0.35968,0.31319999999999998,0.53952,0.53723355594181688,0.41130729119019305,null,"R-Bin08 b"]
["R-Bin09 a",0,"R-Bin09 a",-0.99223700000000004,null,30,525,8.9894829999999999,null,"CCT [K]",{"$f":"IF($A$1=\"\",NA(),INDEX($B$1:$B$300,MATCH(J30,$A$1:$A$300,0)))","v":6137},null,525,8.9894829999999999,null,"TLCI",{"$f":"IF($A$1=\"\",NA(),INDEX($B$1:$B$300,MATCH(P30,$A$1:$A$300,0)))","v":100},30,525,1.3413900000000001,null,"CCT [K]",{"$f":"IF($C$1=\"\",NA(),INDEX($D$1:$D$300,MATCH(V30,$C$1:$C$300,0)))","v":3865},null,525,1.3413900000000001,null,"TLCI",{"$f":"IF($C$1=\"\",NA(),INDEX($D$1:$D$300,MATCH(AB30,$C$1:$C$300,0)))","v":59},null,null,null,0.32129000000000002,0.36010999999999999,0.32129000000000002,0.54016500000000001,0.54712493614122726,0.40882102514616564,null,"R-Bin09 a"]
["R-Bin09 b",0,"R-Bin09 b",-0.124364,null,31,530,9.1116259999999993,null,"Duv",{"$f":"IF($A$1=\"\",NA(),INDEX($B$1:$B$300,MATCH(J31,$A$1:$A$300,0)))","v":5.8999999999999999E-3},null,530,9.1116259999999993,null,"Ref.Type",{"$f":"IF(K30<3400,\"Plank\",IF(K30>5000,\"Daylight\",\"Plank-Daylight Mix\"))","v":"Daylight"},31,530,2.30227,null,"Duv",{"$f":"IF($C$1=\"\",NA(),INDEX($D$1:$D$300,MATCH(V31,$C$1:$C$300,0)))","v":7.4000000000000003E-3},null,530,2.30227,null,"Ref.Type",{"$f":"IF(W30<3400,\"P\",IF(W30>5000,\"D\",\"M\"))","v":"M"},null,null,null,0.32930999999999999,0.36037999999999998,0.32930999999999999,0.54056999999999999,0.55639847261176623,0.4059293301343786,null,"R-Bin09 b"]
["R-Bin10 a",0,"R-Bin10 a",-0.86577899999999997,null,32,535,9.1910430000000005,null,"E vis [fc]",null,null,535,9.1910430000000005,{"$f":"IF(Q32=\"\",NA(),IF(Q32 < 0, 0, Q32))","v":99},"Q1",{"$f":"IF($A$1=\"\",NA(),INDEX($B$1:$B$300,MATCH(P32,$A$1:$A$300,0)))","v":99},32,535,7.0855699999999997,null,"E vis [fc]",null,null,535,7.0855699999999997,null,"Q1",{"$f":"IF($C$1=\"\",NA(),INDEX($D$1:$D$300,MATCH(AB32,$C$1:$C$300,0)))","v":87},null,null,null,0.33723999999999998,0.36051,0.33723999999999998,0.54076499999999994,0.56508042895442345,0.40271447721179615,null,"R-Bin10 a"]
["R-Bin10 b",0,"R-Bin10 b",-0.50042600000000004,null,33,540,9.068149,null,"E vis [lx]",{"$f":"IF(ISNA(MATCH(J32,$A$1:$A$300,0)),IF($A$1=\"\",NA(),INDEX($B$1:$B$300,MATCH(J33,$A$1:$A$300,0))),IF($A$1=\"\",NA(),INDEX($B$1:$B$300,MATCH(J32,$A$1:$A$300,0))))","v":618.20000000000005},null,540,9.068149,{"$f":"IF(Q33=\"\",NA(),IF(Q33 < 0, 0, Q33))","v":99},"Q2",99,33,540,22.755669999999999,null,"E vis [lx]",{"$f":"IF(ISNA(MATCH(V32,$C$1:$C$300,0)),IF($C$1=\"\",NA(),INDEX($D$1:$D$300,MATCH(V33,$C$1:$C$300,0))),IF($C$1=\"\",NA(),INDEX($D$1:$D$300,MATCH(V32,$C$1:$C$300,0))))","v":618.98},null,540,22.755669999999999,null,"Q2",95,null,null,null,0.37,0.35980000000000001,{"$f":"AG33","v":0.37},{"$f":"AH33*1.5","v":0.53970000000000007},{"$f":"(9*AG33)/(6*AG33-16*AJ33+12)","v":0.59626128061882266},{"$f":"(4*AJ33)/(6*AG33-16*AJ33+12)","v":0.38654920498495932},null,"R-Bin10 b"]
["R-Bin11 a",0,"R-Bin11 a",-0.58389500000000005,null,34,545,9.0134760000000007,null,null,null,null,545,9.0134760000000007,99,"Q3",99,34,545,32.732309999999998,null,null,null,null,545,32.732309999999998,null,"Q3",95,null,null,null,0.4,0.35699999999999998,{"$f":"AG34","v":0.4},{"$f":"AH34*1.5","v":0.53549999999999998},{"$f":"(9*AG34)/(6*AG34-16*AJ34+12)","v":0.61728395061728392},{"$f":"(4*AJ34)/(6*AG34-16*AJ34+12)","v":0.36728395061728386},null,"R-Bin11 a"]
["R-Bin11 b",0,"R-Bin11 b",-0.81182900000000002,null,35,550,9.0122099999999996,null,"Flicker Index",{"$f":"IF($A$1=\"\",NA(),INDEX($B$1:$B$300,MATCH(J35,$A$1:$A$300,0)))","v":1.261E-3},null,550,9.0122099999999996,99,"Q4",99,35,550,20.21733,null,"Flicker Index",{"$f":"IF($C$1=\"\",NA(),INDEX($D$1:$D$300,MATCH(V35,$C$1:$C$300,0)))","v":7.9000000000000001E-2},null,550,20.21733,null,"Q4",73,null,null,null,null,null,null,null,null,null,null,"R-Bin11 b"]
["R-Bin12 a",0,"R-Bin12 a",-0.32841799999999999,null,36,555,8.8750739999999997,null,"Flicker [Hz]",{"$f":"IF($A$1=\"\",NA(),INDEX($B$1:$B$300,MATCH(J36,$A$1:$A$300,0)))","v":0},null,555,8.8750739999999997,99,"Q5",99,36,555,7.17197,null,"Flicker [Hz]",{"$f":"IF($C$1=\"\",NA(),INDEX($D$1:$D$300,MATCH(V36,$C$1:$C$300,0)))","v":99.9},null,555,7.17197,null,"Q5",55,null,null,null,null,null,null,null,null,null,null,"R-Bin12 a"]
["R-Bin12 b",0,"R-Bin12 b",-0.94453200000000004,null,37,560,8.7053999999999991,null,"Flicker [%]",{"$f":"IF($A$1=\"\",NA(),INDEX($B$1:$B$300,MATCH(J37,$A$1:$A$300,0)))","v":1.052689},null,560,8.7053999999999991,99,"Q6",99,37,560,2.5609999999999999,null,"Flicker [%]",{"$f":"IF($C$1=\"\",NA(),INDEX($D$1:$D$300,MATCH(V37,$C$1:$C$300,0)))","v":27.7},null,560,2.5609999999999999,null,"Q6",55,null,null,null,null,null,null,null,null,null,null,"R-Bin12 b"]
["R-Bin13 a",0,"R-Bin13 a",0.16761999999999999,null,38,565,8.4653109999999998,null,"Excitation Purity [%]",null,null,565,8.4653109999999998,99,"Q7",99,38,565,1.50362,null,"Excitation Purity [%]",null,null,565,1.50362,null,"Q7",99,null,null,null,null,null,null,null,null,null,null,"R-Bin13 a"]
["R-Bin13 b",0,"R-Bin13 b",-0.98585199999999995,null,39,570,8.3170359999999999,null,"Farbreinheit [%]",{"$f":"IF(ISNA(MATCH(J38,$A$1:$A$300,0)),IF($A$1=\"\",NA(),INDEX($B$1:$B$300,MATCH(J39,$A$1:$A$300,0))),IF($A$1=\"\",NA(),INDEX($B$1:$B$300,MATCH(J38,$A$1:$A$300,0))))","v":4.5999999999999996},null,570,8.3170359999999999,99,"Q8",99,39,570,1.9446399999999999,null,"Farbreinheit [%]",{"$f":"IF(ISNA(MATCH(V38,$C$1:$C$300,0)),IF($C$1=\"\",NA(),INDEX($D$1:$D$300,MATCH(V39,$C$1:$C$300,0))),IF($C$1=\"\",NA(),INDEX($D$1:$D$300,MATCH(V38,$C$1:$C$300,0))))","v":38},null,570,1.9446399999999999,null,"Q8",87,null,null,null,null,null,null,null,null,null,null,"R-Bin13 b"]
["R-Bin14 a",0,"R-Bin14 a",0.46185399999999999,null,40,575,8.1715920000000004,null,"Dominante Wellenlänge [nm]",{"$f":"IF(ISNA(MATCH(J41,$A$1:$A$300,0)),IF($A$1=\"\",NA(),INDEX($B$1:$B$300,MATCH(\"Dominante Wellenl*\",$A$1:$A$300,0))),IF($A$1=\"\",NA(),INDEX($B$1:$B$300,MATCH(J41,$A$1:$A$300,0))))","v":495},null,575,8.1715920000000004,99,"Q9",99,40,575,4.2584400000000002,null,"Dominante Wellenlänge [nm]",{"$f":"IF(ISNA(MATCH(V41,$C$1:$C$300,0)),IF($C$1=\"\",NA(),INDEX($D$1:$D$300,MATCH(V40,$C$1:$C$300,0))),IF($C$1=\"\",NA(),INDEX($D$1:$D$300,MATCH(V41,$C$1:$C$300,0))))","v":576},null,575,4.2584400000000002,null,"Q9",90,null,null,null,null,null,null,null,null,null,null,"R-Bin14 a"]
["R-Bin14 b",0,"R-Bin14 b",-0.88695599999999997,null,41,580,8.1001600000000007,null,"Dominant wavelength [nm]",null,null,580,8.1001600000000007,99,"Q10",99,41,580,7.9811199999999998,null,"Dominant wavelength [nm]",null,null,580,7.9811199999999998,null,"Q10",98,null,null,null,null,null,null,null,null,null,null,"R-Bin14 b"]
["R-Bin15 a",0,"R-Bin15 a",0.79975399999999996,null,42,585,8.0237320000000008,null,null,null,null,585,8.0237320000000008,99,"Q11",99,42,585,10.12635,null,null,null,null,585,10.12635,null,"Q11",34,null,null,null,null,null,null,null,null,null,null,"R-Bin15 a"]
["R-Bin15 b",0,"R-Bin15 b",-0.60032799999999997,null,43,590,7.7804159999999998,null,"TM30 Rf",{"$f":"IF($A$1=\"\",NA(),INDEX($B$1:$B$300,MATCH(J43,$A$1:$A$300,0)))","v":0},null,590,7.7804159999999998,99,"Q12",99,43,590,9.0343300000000006,null,"TM30 Rf",{"$f":"IF($C$1=\"\",NA(),INDEX($D$1:$D$300,MATCH(V43,$C$1:$C$300,0)))","v":80.7},null,590,9.0343300000000006,null,"Q12",80,null,null,null,null,null,null,null,null,null,null,"R-Bin15 b"]
["R-Bin16 a",0,"R-Bin16 a",0.98641699999999999,null,44,595,7.7598640000000003,null,"TM30 Rg",0,null,595,7.7598640000000003,99,"Q13",99,44,595,6.4294599999999997,null,"TM30 Rg",97.1,null,595,6.4294599999999997,null,"Q13",42,null,null,null,null,null,null,null,null,null,null,"R-Bin16 a"]
["R-Bin16 b",0,"R-Bin16 b",-0.16425899999999999,null,45,600,7.767684,null,"R-Bin01 a",0,null,600,7.767684,99,"Q14",99,45,600,5.6601299999999997,null,"R-Bin01 a",0.97269799999999995,null,600,5.6601299999999997,null,"Q14",90,null,null,null,null,null,null,null,null,null,null,"R-Bin16 b"]
["T-Bin01 a",0,"T-Bin01 a",0.87926199999999999,null,46,605,7.731814,null,"R-Bin01 b",0,null,605,7.731814,99,"Q15",99,46,605,10.57896,null,"R-Bin01 b",0.232073,null,605,10.57896,null,"Q15",60,null,null,null,null,null,null,null,null,null,null,"T-Bin01 a"]
["T-Bin01 b",0,"T-Bin01 b",0.17941099999999999,null,47,610,7.6200130000000001,null,"R-Bin02 a",0,null,610,7.6200130000000001,99,"Q16",99,47,610,22.982099999999999,null,"R-Bin02 a",0.81894100000000003,null,610,22.982099999999999,null,"Q16",59,null,null,null,null,null,null,null,null,null,null,"T-Bin01 b"]
["T-Bin02 a",0,"T-Bin02 a",0.79713400000000001,null,48,615,7.4500609999999998,null,"R-Bin02 b",0,null,615,7.4500609999999998,99,"Q17",99,48,615,22.818090000000002,null,"R-Bin02 b",0.573878,null,615,22.818090000000002,null,"Q17",63,null,null,null,null,null,null,null,null,null,null,"T-Bin02 a"]
["T-Bin02 b",0,"T-Bin02 b",0.560921,null,49,620,7.3865400000000001,null,"R-Bin03 a",0,null,620,7.3865400000000001,99,"Q18",99,49,620,12.559049999999999,null,"R-Bin03 a",0.55005899999999996,null,620,12.559049999999999,null,"Q18",43,null,null,null,null,null,null,null,null,null,null,"T-Bin02 b"]
["T-Bin03 a",0,"T-Bin03 a",0.46388299999999999,null,50,625,7.2048059999999996,null,"R-Bin03 b",0,null,625,7.2048059999999996,null,"R Lightness",0,50,625,8.2346599999999999,null,"R-Bin03 b",0.83512600000000003,null,625,8.2346599999999999,null,"R Lightness",4,null,null,null,null,null,null,null,null,null,null,"T-Bin03 a"]
["T-Bin03 b",0,"T-Bin03 b",0.84186700000000003,null,51,630,7.0726630000000004,null,"R-Bin04 a",0,null,630,7.0726630000000004,null,"R Chroma",0,51,630,6.0498500000000002,null,"R-Bin04 a",0.166876,null,630,6.0498500000000002,null,"R Chroma",2,null,null,null,null,null,null,null,null,null,null,"T-Bin03 b"]
["T-Bin04 a",0,"T-Bin04 a",4.3272999999999999E-2,null,52,635,7.0878990000000002,null,"R-Bin04 b",0,null,635,7.0878990000000002,null,"R Hue",0,52,635,3.66927,null,"R-Bin04 b",0.98597800000000002,null,635,3.66927,null,"R Hue",0,null,null,null,null,null,null,null,null,null,null,"T-Bin04 a"]
["T-Bin04 b",0,"T-Bin04 b",1.036959,null,53,640,7.0419169999999998,null,"R-Bin05 a",0,null,640,7.0419169999999998,null,"R/Y Lightness",0,53,640,1.92031,null,"R-Bin05 a",-0.11511399999999999,null,640,1.92031,null,"R/Y Lightness",0,null,null,null,null,null,null,null,null,null,null,"T-Bin04 b"]
["T-Bin05 a",0,"T-Bin05 a",-0.212446,null,54,645,6.8986169999999998,null,"R-Bin05 b",0,null,645,6.8986169999999998,null,"R/Y Chroma",0,54,645,1.82274,null,"R-Bin05 b",0.99335200000000001,null,645,1.82274,null,"R/Y Chroma",0,null,null,null,null,null,null,null,null,null,null,"T-Bin05 a"]
["T-Bin05 b",0,"T-Bin05 b",1.0555110000000001,null,55,650,6.7647389999999996,null,"R-Bin06 a",0,null,650,6.7647389999999996,null,"R/Y Hue",0,55,650,1.9939499999999999,null,"R-Bin06 a",-0.55029300000000003,null,650,1.9939499999999999,null,"R/Y Hue",0,null,null,null,null,null,null,null,null,null,null,"T-Bin05 b"]
["T-Bin06 a",0,"T-Bin06 a",-0.57788200000000001,null,56,655,6.6299609999999998,null,"R-Bin06 b",0,null,655,6.6299609999999998,null,"Y Lightness",0,56,655,1.7634399999999999,null,"R-Bin06 b",0.83497200000000005,null,655,1.7634399999999999,null,"Y Lightness",-2,null,null,null,null,null,null,null,null,null,null,"T-Bin06 a"]
["T-Bin06 b",0,"T-Bin06 b",0.88236099999999995,null,57,660,6.6271659999999999,null,"R-Bin07 a",0,null,660,6.6271659999999999,null,"Y Chroma",0,57,660,1.52664,null,"R-Bin07 a",-0.85750700000000002,null,660,1.52664,null,"Y Chroma",0,null,null,null,null,null,null,null,null,null,null,"T-Bin06 b"]
["T-Bin07 a",0,"T-Bin07 a",-0.79100400000000004,null,58,665,6.706842,null,"R-Bin07 b",0,null,665,6.706842,null,"Y Hue",0,58,665,1.48909,null,"R-Bin07 b",0.51447299999999996,null,665,1.48909,null,"Y Hue",-5,null,null,null,null,null,null,null,null,null,null,"T-Bin07 a"]
["T-Bin07 b",0,"T-Bin07 b",0.57284599999999997,null,59,670,6.6757350000000004,null,"R-Bin08 a",0,null,670,6.6757350000000004,null,"Y/G Lightness",0,59,670,1.36496,null,"R-Bin08 a",-0.99007599999999996,null,670,1.36496,null,"Y/G Lightness",-2,null,null,null,null,null,null,null,null,null,null,"T-Bin07 b"]
["T-Bin08 a",0,"T-Bin08 a",-0.927338,null,60,675,6.5624269999999996,null,"R-Bin08 b",0,null,675,6.5624269999999996,null,"Y/G Chroma",0,60,675,1.2158599999999999,null,"R-Bin08 b",0.14052999999999999,null,675,1.2158599999999999,null,"Y/G Chroma",-3,null,null,null,null,null,null,null,null,null,null,"T-Bin08 a"]
["T-Bin08 b",0,"T-Bin08 b",0.18793899999999999,null,61,680,6.3496920000000001,null,"R-Bin09 a",0,null,680,6.3496920000000001,null,"Y/G Hue",0,61,680,1.29491,null,"R-Bin09 a",-0.99223700000000004,null,680,1.29491,null,"Y/G Hue",-2,null,null,null,null,null,null,null,null,null,null,"T-Bin08 b"]
["T-Bin09 a",0,"T-Bin09 a",-0.918624,null,62,685,5.9583259999999996,null,"R-Bin09 b",0,null,685,5.9583259999999996,null,"G Lightness",0,62,685,1.2431700000000001,null,"R-Bin09 b",-0.124364,null,685,1.2431700000000001,null,"G Lightness",-3,null,null,null,null,null,null,null,null,null,null,"T-Bin09 a"]
["T-Bin09 b",0,"T-Bin09 b",-8.4933999999999996E-2,null,63,690,5.7667929999999998,null,"R-Bin10 a",0,null,690,5.7667929999999998,null,"G Chroma",0,63,690,1.2886299999999999,null,"R-Bin10 a",-0.86577899999999997,null,690,1.2886299999999999,null,"G Chroma",-3,null,null,null,null,null,null,null,null,null,null,"T-Bin09 b"]
["T-Bin10 a",0,"T-Bin10 a",-0.68898099999999995,null,64,695,6.0055940000000003,null,"R-Bin10 b",0,null,695,6.0055940000000003,null,"G Hue",{"$f":"IF($A$1=\"\",NA(),INDEX($B$1:$B$300,MATCH(P64,$A$1:$A$300,0)))","v":0},64,695,1.11232,null,"R-Bin10 b",-0.50042600000000004,null,695,1.11232,null,"G Hue",{"$f":"IF($C$1=\"\",NA(),INDEX($D$1:$D$300,MATCH(AB64,$C$1:$C$300,0)))","v":0},null,null,null,null,null,null,null,null,null,null,"T-Bin10 a"]
["T-Bin10 b",0,"T-Bin10 b",-0.53937900000000005,null,65,700,6.2686070000000003,null,"R-Bin11 a",0,null,700,6.2686070000000003,null,"G/C Lightness",0,65,700,1.27946,null,"R-Bin11 a",-0.58389500000000005,null,700,1.27946,null,"G/C Lightness",-3,null,null,null,null,null,null,null,null,null,null,"T-Bin10 b"]
["T-Bin11 a",0,"T-Bin11 a",-0.43632700000000002,null,66,705,6.4813590000000003,null,"R-Bin11 b",0,null,{"$f":"IF(G66=\"\",NA(),ROUND(G66,0))","v":705},{"$f":"IF(H66=\"\",NA(),H66)","v":6.4813590000000003},null,"G/C Chroma",0,66,705,2.5384899999999999,null,"R-Bin11 b",-0.81182900000000002,null,{"$f":"IF(S66=\"\",NA(),ROUND(S66,0))","v":705},{"$f":"IF(T66=\"\",NA(),T66)","v":2.5384899999999999},null,"G/C Chroma",-3,null,null,null,null,null,null,null,null,null,null,"T-Bin11 a"]
["T-Bin11 b",0,"T-Bin11 b",-0.84362700000000002,null,{"$f":"F66+1","v":67},710,6.5850799999999996,null,"R-Bin12 a",0,null,710,6.5850799999999996,null,"G/C Hue",0,{"$f":"R66+1","v":67},710,2.9487100000000002,null,"R-Bin12 a",-0.32841799999999999,null,710,2.9487100000000002,null,"G/C Hue",0,null,null,null,null,null,null,null,null,null,null,"T-Bin11 b"]
["T-Bin12 a",0,"T-Bin12 a",-0.26920100000000002,null,68,715,6.3130559999999996,null,"R-Bin12 b",0,null,715,6.3130559999999996,null,"C Lightness",0,68,715,1.94228,null,"R-Bin12 b",-0.94453200000000004,null,715,1.94228,null,"C Lightness",-3,null,null,null,null,null,null,null,null,null,null,"T-Bin12 a"]
["T-Bin12 b",0,"T-Bin12 b",-0.98637900000000001,null,69,720,6.0558719999999999,null,"R-Bin13 a",0,null,720,6.0558719999999999,null,"C Chroma",0,69,720,0.82393000000000005,null,"R-Bin13 a",0.16761999999999999,null,720,0.82393000000000005,null,"C Chroma",-3,null,null,null,null,null,null,null,null,null,null,"T-Bin12 b"]
["T-Bin13 a",0,"T-Bin13 a",0.11852600000000001,null,70,{"$f":"IF(G69=\"\",\"\",IF(INDEX($A$1:$A$500,MATCH(\"Spe*\",$A$1:$A$500,0)+F70)=0,\"\",INDEX($A$1:$A$500,MATCH(\"Spe*\",$A$1:$A$500,0)+F70)))","v":725},{"$f":"IF(H69=\"\",\"\",IF(INDEX($A$1:$A$500,MATCH(\"Spe*\",$A$1:$A$500,0)+F70)=0,\"\",INDEX($B$1:$B$500,MATCH(\"Spe*\",$A$1:$A$500,0)+F70)))","v":6.1839829999999996},null,"R-Bin13 b",0,null,725,6.1839829999999996,null,"C Hue",0,70,{"$f":"IF(S69=\"\",\"\",IF(INDEX($C$1:$C$500,MATCH(\"Spe*\",$C$1:$C$500,0)+R70)=0,\"\",INDEX($C$1:$C$500,MATCH(\"Spe*\",$C$1:$C$500,0)+R70)))","v":725},{"$f":"IF(T69=\"\",\"\",IF(INDEX($C$1:$C$500,MATCH(\"Spe*\",$C$1:$C$500,0)+R70)=0,\"\",INDEX($D$1:$D$500,MATCH(\"Spe*\",$C$1:$C$500,0)+R70)))","v":0.58525000000000005},null,"R-Bin13 b",-0.98585199999999995,null,725,0.58525000000000005,null,"C Hue",0,null,null,null,null,null,null,null,null,null,null,"T-Bin13 a"]
["T-Bin13 b",0,"T-Bin13 b",-1.0608679999999999,null,71,730,6.6153399999999998,null,"R-Bin14 a",0,null,730,6.6153399999999998,null,"C/B Lightness",0,71,730,0.51885000000000003,null,"R-Bin14 a",0.46185399999999999,null,730,0.51885000000000003,null,"C/B Lightness",3,null,null,null,null,null,null,null,null,null,null,"T-Bin13 b"]
["T-Bin14 a",0,"T-Bin14 a",0.530972,null,72,735,7.1217439999999996,null,"R-Bin14 b",0,null,735,7.1217439999999996,null,"C/B Chroma",0,72,735,0.55154000000000003,null,"R-Bin14 b",-0.88695599999999997,null,735,0.55154000000000003,null,"C/B Chroma",0,null,null,null,null,null,null,null,null,null,null,"T-Bin14 a"]
["T-Bin14 b",0,"T-Bin14 b",-0.92593899999999996,null,73,740,7.4515640000000003,null,"R-Bin15 a",0,null,740,7.4515640000000003,null,"C/B Hue",0,73,740,0.59487999999999996,null,"R-Bin15 a",0.79975399999999996,null,740,0.59487999999999996,null,"C/B Hue",-5,null,null,null,null,null,null,null,null,null,null,"T-Bin14 b"]
["T-Bin15 a",0,"T-Bin15 a",0.75736599999999998,null,74,745,7.6437429999999997,null,"R-Bin15 b",0,null,745,7.6437429999999997,null,"B Lightness",0,74,745,0.63714999999999999,null,"R-Bin15 b",-0.60032799999999997,null,745,0.63714999999999999,null,"B Lightness",1,null,null,null,null,null,null,null,null,null,null,"T-Bin15 a"]
["T-Bin15 b",0,"T-Bin15 b",-0.68800099999999997,null,75,750,7.5227430000000002,null,"R-Bin16 a",{"$f":"IF($A$1=\"\",NA(),INDEX($B$1:$B$300,MATCH(J75,$A$1:$A$300,0)))","v":0},null,750,7.5227430000000002,null,"B Chroma",0,75,750,0.58233999999999997,null,"R-Bin16 a",{"$f":"IF($C$1=\"\",NA(),INDEX($D$1:$D$300,MATCH(V75,$C$1:$C$300,0)))","v":0.98641699999999999},null,750,0.58233999999999997,null,"B Chroma",-1,null,null,null,null,null,null,null,null,null,null,"T-Bin15 b"]
["T-Bin16 a",0,"T-Bin16 a",0.94998899999999997,null,76,755,6.6333419999999998,null,"R-Bin16 b",0,null,755,6.6333419999999998,null,"B Hue",0,76,755,0.51898999999999995,null,"R-Bin16 b",-0.16425899999999999,null,755,0.51898999999999995,null,"B Hue",-2,null,null,null,null,null,null,null,null,null,null,"T-Bin16 a"]
["T-Bin16 b",0,"T-Bin16 b",-0.26048700000000002,null,77,760,5.164568,null,"T-Bin01 a",0,null,760,5.164568,null,"B/M Lightness",0,77,760,0.53081999999999996,null,"T-Bin01 a",0.87926199999999999,null,760,0.53081999999999996,null,"B/M Lightness",3,null,null,null,null,null,null,null,null,null,null,"T-Bin16 b"]
["Rf_Bin01",0,"Rf_Bin01",78,null,78,765,5.1724899999999998,null,"T-Bin01 b",0,null,765,5.1724899999999998,null,"B/M Chroma",0,78,765,0.35544999999999999,null,"T-Bin01 b",0.17941099999999999,null,765,0.35544999999999999,null,"B/M Chroma",-2,null,null,null,null,null,null,null,null,null,null,"Rf_Bin01"]
["Rf_Bin02",0,"Rf_Bin02",91,null,79,770,6.4865500000000003,null,"T-Bin02 a",0,null,770,6.4865500000000003,null,"B/M Hue",0,79,770,0.53188000000000002,null,"T-Bin02 a",0.79713400000000001,null,770,0.53188000000000002,null,"B/M Hue",4,null,null,null,null,null,null,null,null,null,null,"Rf_Bin02"]
["Rf_Bin03",0,"Rf_Bin03",81,null,80,775,7.1510049999999996,null,"T-Bin02 b",0,null,775,7.1510049999999996,null,"M Lightness",0,80,775,0.43961,null,"T-Bin02 b",0.560921,null,775,0.43961,null,"M Lightness",3,null,null,null,null,null,null,null,null,null,null,"Rf_Bin03"]
["Rf_Bin04",0,"Rf_Bin04",76,null,81,780,7.1717950000000004,null,"T-Bin03 a",0,null,780,7.1717950000000004,null,"M Chroma",0,81,780,0.55608000000000002,null,"T-Bin03 a",0.46388299999999999,null,780,0.55608000000000002,null,"M Chroma",-2,null,null,null,null,null,null,null,null,null,null,"Rf_Bin04"]
["Rf_Bin05",0,"Rf_Bin05",79,null,82,"","",null,"T-Bin03 b",0,null,{"$error":"#N/A"},{"$error":"#N/A"},null,"M Hue",0,82,"","",null,"T-Bin03 b",0.84186700000000003,null,{"$error":"#N/A"},{"$error":"#N/A"},null,"M Hue",4,null,null,null,null,null,null,null,null,null,null,"Rf_Bin05"]
["Rf_Bin06",0,"Rf_Bin06",90,null,83,"","",null,"T-Bin04 a",0,null,{"$error":"#N/A"},{"$error":"#N/A"},null,"M/R Lightness",0,83,"","",null,"T-Bin04 a",4.3272999999999999E-2,null,{"$f":"IF(S83=\"\",NA(),ROUND(S83,0))","v":{"$error":"#N/A"}},{"$f":"IF(T83=\"\",NA(),T83)","v":{"$error":"#N/A"}},null,"M/R Lightness",4,null,null,null,null,null,null,null,null,null,null,"Rf_Bin06"]
["Rf_Bin07",0,"Rf_Bin07",84,null,84,"","",null,"T-Bin04 b",0,null,{"$error":"#N/A"},{"$error":"#N/A"},null,"M/R Chroma",0,84,"","",null,"T-Bin04 b",1.036959,null,{"$error":"#N/A"},{"$error":"#N/A"},null,"M/R Chroma",0,null,null,null,null,null,null,null,null,null,null,"Rf_Bin07"]
["Rf_Bin08",0,"Rf_Bin08",85,null,85,"","",null,"T-Bin05 a",0,null,{"$error":"#N/A"},{"$error":"#N/A"},null,"M/R Hue",0,85,"","",null,"T-Bin05 a",-0.212446,null,{"$error":"#N/A"},{"$error":"#N/A"},null,"M/R Hue",4,null,null,null,null,null,null,null,null,null,null,"Rf_Bin08"]
["Rf_Bin09",0,"Rf_Bin09",87,null,86,"","",null,"T-Bin05 b",0,null,{"$error":"#N/A"},{"$error":"#N/A"},null,null,null,86,"","",null,"T-Bin05 b",1.0555110000000001,null,{"$error":"#N/A"},{"$error":"#N/A"},null,null,null,null,null,null,null,null,null,null,null,null,null,"Rf_Bin09"]
["Rf_Bin10",0,"Rf_Bin10",67,null,87,"","",null,"T-Bin06 a",0,null,{"$error":"#N/A"},{"$error":"#N/A"},null,null,null,87,"","",null,"T-Bin06 a",-0.57788200000000001,null,{"$error":"#N/A"},{"$error":"#N/A"},null,null,null,null,null,null,null,null,null,null,null,null,null,"Rf_Bin10"]
["Rf_Bin11",0,"Rf_Bin11",75,null,88,"","",null,"T-Bin06 b",0,null,{"$error":"#N/A"},{"$error":"#N/A"},null,null,null,88,"","",null,"T-Bin06 b",0.88236099999999995,null,{"$error":"#N/A"},{"$error":"#N/A"},null,null,null,null,null,null,null,null,null,null,null,null,null,"Rf_Bin11"]
["Rf_Bin12",0,"Rf_Bin12",82,null,89,"","",null,"T-Bin07 a",0,null,{"$error":"#N/A"},{"$error":"#N/A"},null,null,null,89,"","",null,"T-Bin07 a",-0.79100400000000004,null,{"$error":"#N/A"},{"$error":"#N/A"},null,null,null,null,null,null,null,null,null,null,null,null,null,"Rf_Bin12"]
["Rf_Bin13",0,"Rf_Bin13",80,null,90,"","",null,"T-Bin07 b",0,null,{"$error":"#N/A"},{"$error":"#N/A"},null,null,null,90,"","",null,"T-Bin07 b",0.57284599999999997,null,{"$error":"#N/A"},{"$error":"#N/A"},null,null,null,null,null,null,null,null,null,null,null,null,null,"Rf_Bin13"]
["Rf_Bin14",0,"Rf_Bin14",85,null,91,"","",null,"T-Bin08 a",0,null,{"$error":"#N/A"},{"$error":"#N/A"},null,null,null,91,"","",null,"T-Bin08 a",-0.927338,null,{"$error":"#N/A"},{"$error":"#N/A"},null,null,null,null,null,null,null,null,null,null,null,null,null,"Rf_Bin14"]
["Rf_Bin15",0,"Rf_Bin15",81,null,92,"","",null,"T-Bin08 b",0,null,{"$error":"#N/A"},{"$error":"#N/A"},null,null,null,92,"","",null,"T-Bin08 b",0.18793899999999999,null,{"$error":"#N/A"},{"$error":"#N/A"},null,null,null,null,null,null,null,null,null,null,null,null,null,"Rf_Bin15"]
["Rf_Bin16",0,"Rf_Bin16",78,null,93,"","",null,"T-Bin09 a",0,null,{"$error":"#N/A"},{"$error":"#N/A"},null,null,null,93,"","",null,"T-Bin09 a",-0.918624,null,{"$error":"#N/A"},{"$error":"#N/A"},null,null,null,null,null,null,null,null,null,null,null,null,null,"Rf_Bin16"]
["Chromashift01 [%]",0,"Chromashift01 [%]",-10,null,94,"","",null,"T-Bin09 b",0,null,{"$error":"#N/A"},{"$error":"#N/A"},null,null,null,94,"","",null,"T-Bin09 b",-8.4933999999999996E-2,null,{"$error":"#N/A"},{"$error":"#N/A"},null,null,null,null,null,null,null,null,null,null,null,null,null,"Chromashift01 [%]"]
["Chromashift02 [%]",0,"Chromashift02 [%]",-3,null,95,"","",null,"T-Bin10 a",0,null,{"$error":"#N/A"},{"$error":"#N/A"},null,null,null,95,"","",null,"T-Bin10 a",-0.68898099999999995,null,{"$error":"#N/A"},{"$error":"#N/A"},null,null,null,null,null,null,null,null,null,null,null,null,null,"Chromashift02 [%]"]
["Chromashift03 [%]",0,"Chromashift03 [%]",-4,null,96,"","",null,"T-Bin10 b",0,null,{"$error":"#N/A"},{"$error":"#N/A"},null,null,null,96,"","",null,"T-Bin10 b",-0.53937900000000005,null,{"$error":"#N/A"},{"$error":"#N/A"},null,null,null,null,null,null,null,null,null,null,null,null,null,"Chromashift03 [%]"]
["Chromashift04 [%]",0,"Chromashift04 [%]",3,null,97,"","",null,"T-Bin11 a",0,null,{"$error":"#N/A"},{"$error":"#N/A"},null,null,null,97,"","",null,"T-Bin11 a",-0.43632700000000002,null,{"$error":"#N/A"},{"$error":"#N/A"},null,null,null,null,null,null,null,null,null,null,null,null,null,"Chromashift04 [%]"]
["Chromashift05 [%]",0,"Chromashift05 [%]",8,null,98,"","",null,"T-Bin11 b",0,null,{"$error":"#N/A"},{"$error":"#N/A"},null,null,null,98,"","",null,"T-Bin11 b",-0.84362700000000002,null,{"$f":"IF(S98=\"\",NA(),ROUND(S98,0))","v":{"$error":"#N/A"}},{"$f":"IF(T98=\"\",NA(),T98)","v":{"$error":"#N/A"}},null,null,null,null,null,null,null,null,null,null,null,null,null,"Chromashift05 [%]"]
["Chromashift06 [%]",0,"Chromashift06 [%]",5,null,99,"","",null,"T-Bin12 a",0,null,{"$error":"#N/A"},{"$error":"#N/A"},null,null,null,99,"","",null,"T-Bin12 a",-0.26920100000000002,null,{"$error":"#N/A"},{"$error":"#N/A"},null,null,null,null,null,null,null,null,null,null,null,null,null,"Chromashift06 [%]"]
["Chromashift07 [%]",0,"Chromashift07 [%]",-2,null,100,"","",null,"T-Bin12 b",0,null,{"$error":"#N/A"},{"$error":"#N/A"},null,null,null,100,"","",null,"T-Bin12 b",-0.98637900000000001,null,{"$error":"#N/A"},{"$error":"#N/A"},null,null,null,null,null,null,null,null,null,null,null,null,null,"Chromashift07 [%]"]
["Chromashift08 [%]",0,"Chromashift08 [%]",-5,null,101,"","",null,"T-Bin13 a",0,null,{"$error":"#N/A"},{"$error":"#N/A"},null,null,null,101,"","",null,"T-Bin13 a",0.11852600000000001,null,{"$error":"#N/A"},{"$error":"#N/A"},null,null,null,null,null,null,null,null,null,null,null,null,null,"Chromashift08 [%]"]
["Chromashift09 [%]",0,"Chromashift09 [%]",-8,null,102,"","",null,"T-Bin13 b",0,null,{"$error":"#N/A"},{"$error":"#N/A"},null,null,null,102,"","",null,"T-Bin13 b",-1.0608679999999999,null,{"$error":"#N/A"},{"$error":"#N/A"},null,null,null,null,null,null,null,null,null,null,null,null,null,"Chromashift09 [%]"]
["Chromashift10 [%]",0,"Chromashift10 [%]",-13,null,103,"","",null,"T-Bin14 a",0,null,{"$error":"#N/A"},{"$error":"#N/A"},null,null,null,103,"","",null,"T-Bin14 a",0.530972,null,{"$error":"#N/A"},{"$error":"#N/A"},null,null,null,null,null,null,null,null,null,null,null,null,null,"Chromashift10 [%]"]
["Chromashift11 [%]",0,"Chromashift11 [%]",-6,null,104,"","",null,"T-Bin14 b",0,null,{"$error":"#N/A"},{"$error":"#N/A"},null,null,null,104,"","",null,"T-Bin14 b",-0.92593899999999996,null,{"$error":"#N/A"},{"$error":"#N/A"},null,null,null,null,null,null,null,null,null,null,null,null,null,"Chromashift11 [%]"]
["Chromashift12 [%]",0,"Chromashift12 [%]",3,null,105,"","",null,"T-Bin15 a",0,null,{"$error":"#N/A"},{"$error":"#N/A"},null,null,null,105,"","",null,"T-Bin15 a",0.75736599999999998,null,{"$error":"#N/A"},{"$error":"#N/A"},null,null,null,null,null,null,null,null,null,null,null,null,null,"Chromashift12 [%]"]
["Chromashift13 [%]",0,"Chromashift13 [%]",6,null,106,"","",null,"T-Bin15 b",0,null,{"$error":"#N/A"},{"$error":"#N/A"},null,null,null,106,"","",null,"T-Bin15 b",-0.68800099999999997,null,{"$error":"#N/A"},{"$error":"#N/A"},null,null,null,null,null,null,null,null,null,null,null,null,null,"Chromashift13 [%]"]
["Chromashift14 [%]",0,"Chromashift14 [%]",7,null,107,"","",null,"T-Bin16 a",{"$f":"IF($A$1=\"\",NA(),INDEX($B$1:$B$300,MATCH(J107,$A$1:$A$300,0)))","v":0},null,{"$error":"#N/A"},{"$error":"#N/A"},null,null,null,107,"","",null,"T-Bin16 a",{"$f":"IF($C$1=\"\",NA(),INDEX($D$1:$D$300,MATCH(V107,$C$1:$C$300,0)))","v":0.94998899999999997},null,{"$error":"#N/A"},{"$error":"#N/A"},null,null,null,null,null,null,null,null,null,null,null,null,null,"Chromashift14 [%]"]
["Chromashift15 [%]",0,"Chromashift15 [%]",1,null,108,"","",null,"T-Bin16 b",0,null,{"$error":"#N/A"},{"$error":"#N/A"},null,null,null,108,"","",null,"T-Bin16 b",-0.26048700000000002,null,{"$error":"#N/A"},{"$error":"#N/A"},null,null,null,null,null,null,null,null,null,null,null,null,null,"Chromashift15 [%]"]
["Chromashift16 [%]",0,"Chromashift16 [%]",-2,null,109,"","",1,"Rf_Bin01",0,null,{"$error":"#N/A"},{"$error":"#N/A"},null,null,null,109,"","",1,"Rf_Bin01",78,null,{"$error":"#N/A"},{"$error":"#N/A"},null,null,null,null,null,null,null,null,null,null,null,null,null,"Chromashift16 [%]"]
["Flicker Index",1.261E-3,"Flicker Index",7.9000000000000001E-2,null,110,"","",2,"Rf_Bin02",0,null,{"$error":"#N/A"},{"$error":"#N/A"},null,null,null,110,"","",2,"Rf_Bin02",91,null,{"$error":"#N/A"},{"$error":"#N/A"},null,null,null,null,null,null,null,null,null,null,null,null,null,"Flicker Index"]
["Flicker [Hz]",0,"Flicker [Hz]",99.9,null,111,"","",3,"Rf_Bin03",0,null,{"$error":"#N/A"},{"$error":"#N/A"},null,null,null,111,"","",3,"Rf_Bin03",81,null,{"$error":"#N/A"},{"$error":"#N/A"},null,null,null,null,null,null,null,null,null,null,null,null,null,"Flicker [Hz]"]
["Flicker [%]",1.052689,"Flicker [%]",27.7,null,112,"","",4,"Rf_Bin04",0,null,{"$error":"#N/A"},{"$error":"#N/A"},null,null,null,112,"","",4,"Rf_Bin04",76,null,{"$error":"#N/A"},{"$error":"#N/A"},null,null,null,null,null,null,null,null,null,null,null,null,null,"Flicker [%]"]
["Ra",97.45,"Ra",81.760000000000005,null,113,"","",5,"Rf_Bin05",0,null,{"$error":"#N/A"},{"$error":"#N/A"},null,null,null,113,"","",5,"Rf_Bin05",79,null,{"$error":"#N/A"},{"$error":"#N/A"},null,null,null,null,null,null,null,null,null,null,null,null,null,"Ra"]
["Re",96.51,"Re",72.739999999999995,null,114,"","",6,"Rf_Bin06",0,null,{"$error":"#N/A"},{"$error":"#N/A"},null,null,null,114,"","",6,"Rf_Bin06",90,null,{"$error":"#N/A"},{"$error":"#N/A"},null,null,null,null,null,null,null,null,null,null,null,null,null,"Re"]
["GAI",92.84,"GAI",67.58,null,115,"","",7,"Rf_Bin07",0,null,{"$error":"#N/A"},{"$error":"#N/A"},null,null,null,115,"","",7,"Rf_Bin07",84,null,{"$error":"#N/A"},{"$error":"#N/A"},null,null,null,null,null,null,null,null,null,null,null,null,null,"GAI"]
["R1",96.71,"R1",92.13,null,116,"","",8,"Rf_Bin08",0,null,{"$error":"#N/A"},{"$error":"#N/A"},null,null,null,116,"","",8,"Rf_Bin08",85,null,{"$error":"#N/A"},{"$error":"#N/A"},null,null,null,null,null,null,null,null,null,null,null,null,null,"R1"]
["R2",98.33,"R2",90.56,null,117,"","",9,"Rf_Bin09",0,null,{"$error":"#N/A"},{"$error":"#N/A"},null,null,null,117,"","",9,"Rf_Bin09",87,null,{"$error":"#N/A"},{"$error":"#N/A"},null,null,null,null,null,null,null,null,null,null,null,null,null,"R2"]
["R3",99.17,"R3",60.36,null,118,"","",10,"Rf_Bin10",0,null,{"$error":"#N/A"},{"$error":"#N/A"},null,null,null,118,"","",10,"Rf_Bin10",67,null,{"$error":"#N/A"},{"$error":"#N/A"},null,null,null,null,null,null,null,null,null,null,null,null,null,"R3"]
["R4",96.5,"R4",87.93,null,119,"","",11,"Rf_Bin11",0,null,{"$error":"#N/A"},{"$error":"#N/A"},null,null,null,119,"","",11,"Rf_Bin11",75,null,{"$error":"#N/A"},{"$error":"#N/A"},null,null,null,null,null,null,null,null,null,null,null,null,null,"R4"]
["R5",96.93,"R5",82.79,null,120,"","",12,"Rf_Bin12",0,null,{"$error":"#N/A"},{"$error":"#N/A"},null,null,null,120,"","",12,"Rf_Bin12",82,null,{"$error":"#N/A"},{"$error":"#N/A"},null,null,null,null,null,null,null,null,null,null,null,null,null,"R5"]
["R6",98.08,"R6",77.28,null,121,"","",13,"Rf_Bin13",0,null,{"$error":"#N/A"},{"$error":"#N/A"},null,null,null,121,"","",13,"Rf_Bin13",80,null,{"$error":"#N/A"},{"$error":"#N/A"},null,null,null,null,null,null,null,null,null,null,null,null,null,"R6"]
["R7",98.45,"R7",91.05,null,122,"","",14,"Rf_Bin14",0,null,{"$error":"#N/A"},{"$error":"#N/A"},null,null,null,122,"","",14,"Rf_Bin14",85,null,{"$error":"#N/A"},{"$error":"#N/A"},null,null,null,null,null,null,null,null,null,null,null,null,null,"R7"]
["R8",95.4,"R8",71.98,null,123,"","",15,"Rf_Bin15",0,null,{"$error":"#N/A"},{"$error":"#N/A"},null,null,null,123,"","",15,"Rf_Bin15",81,null,{"$error":"#N/A"},{"$error":"#N/A"},null,null,null,null,null,null,null,null,null,null,null,null,null,"R8"]
["R9",86.96,"R9",7.09,null,124,"","",16,"Rf_Bin16",0,null,{"$error":"#N/A"},{"$error":"#N/A"},null,null,null,124,"","",16,"Rf_Bin16",78,null,{"$error":"#N/A"},{"$error":"#N/A"},null,null,null,null,null,null,null,null,null,null,null,null,null,"R9"]
["R10",96.71,"R10",48.9,null,125,"","",1,"Chromashift01 [%]",0,null,{"$error":"#N/A"},{"$error":"#N/A"},null,null,null,125,"","",1,"Chromashift01 [%]",-10,null,{"$error":"#N/A"},{"$error":"#N/A"},null,null,null,null,null,null,null,null,null,null,null,null,null,"R10"]
["R11",96.02,"R11",70.989999999999995,null,126,"","",2,"Chromashift02 [%]",0,null,{"$error":"#N/A"},{"$error":"#N/A"},null,null,null,126,"","",2,"Chromashift02 [%]",-3,null,{"$error":"#N/A"},{"$error":"#N/A"},null,null,null,null,null,null,null,null,null,null,null,null,null,"R11"]
["R12",96.51,"R12",53.37,null,127,"","",3,"Chromashift03 [%]",0,null,{"$error":"#N/A"},{"$error":"#N/A"},null,null,null,127,"","",3,"Chromashift03 [%]",-4,null,{"$error":"#N/A"},{"$error":"#N/A"},null,null,null,null,null,null,null,null,null,null,null,null,null,"R12"]
["R13",97.05,"R13",93.49,null,128,"","",4,"Chromashift04 [%]",0,null,{"$error":"#N/A"},{"$error":"#N/A"},null,null,null,128,"","",4,"Chromashift04 [%]",3,null,{"$error":"#N/A"},{"$error":"#N/A"},null,null,null,null,null,null,null,null,null,null,null,null,null,"R13"]
["R14",99.3,"R14",73.55,null,129,"","",5,"Chromashift05 [%]",0,null,{"$error":"#N/A"},{"$error":"#N/A"},null,null,null,129,"","",5,"Chromashift05 [%]",8,null,{"$error":"#N/A"},{"$error":"#N/A"},null,null,null,null,null,null,null,null,null,null,null,null,null,"R14"]
["R15",95.47,"R15",89.59,null,130,"","",6,"Chromashift06 [%]",0,null,{"$f":"IF(G130=\"\",NA(),ROUND(G130,0))","v":{"$error":"#N/A"}},{"$f":"IF(H130=\"\",NA(),H130)","v":{"$error":"#N/A"}},null,null,null,130,"","",6,"Chromashift06 [%]",5,null,{"$error":"#N/A"},{"$error":"#N/A"},null,null,null,null,null,null,null,null,null,null,null,null,null,"R15"]
["x",0.31859999999999999,"x",0.3926,null,{"$f":"F130+1","v":131},"","",7,"Chromashift07 [%]",0,null,{"$error":"#N/A"},{"$error":"#N/A"},null,null,null,{"$f":"R130+1","v":131},"","",7,"Chromashift07 [%]",-2,null,{"$error":"#N/A"},{"$error":"#N/A"},null,null,null,null,null,null,null,null,null,null,null,null,null,"x"]
["y",0.34010000000000001,"y",0.40060000000000001,null,132,"","",8,"Chromashift08 [%]",0,null,{"$error":"#N/A"},{"$error":"#N/A"},null,null,null,132,"","",8,"Chromashift08 [%]",-5,null,{"$error":"#N/A"},{"$error":"#N/A"},null,null,null,null,null,null,null,null,null,null,null,null,null,"y"]
["u",0.1978,"u'",0.22359999999999999,null,133,"","",9,"Chromashift09 [%]",0,null,{"$error":"#N/A"},{"$error":"#N/A"},null,null,null,133,"","",9,"Chromashift09 [%]",-8,null,{"$error":"#N/A"},{"$error":"#N/A"},null,null,null,null,null,null,null,null,null,null,null,null,null,"u"]
["v",0.31669999999999998,"v'",0.51339999999999997,null,134,{"$f":"IF(G133=\"\",\"\",IF(INDEX($A$1:$A$500,MATCH(\"Spe*\",$A$1:$A$500,0)+F134)=0,\"\",INDEX($A$1:$A$500,MATCH(\"Spe*\",$A$1:$A$500,0)+F134)))","v":""},{"$f":"IF(H133=\"\",\"\",IF(INDEX($A$1:$A$500,MATCH(\"Spe*\",$A$1:$A$500,0)+F134)=0,\"\",INDEX($B$1:$B$500,MATCH(\"Spe*\",$A$1:$A$500,0)+F134)))","v":""},10,"Chromashift10 [%]",0,null,{"$error":"#N/A"},{"$error":"#N/A"},null,null,null,134,{"$f":"IF(S133=\"\",\"\",IF(INDEX($C$1:$C$500,MATCH(\"Spe*\",$C$1:$C$500,0)+R134)=0,\"\",INDEX($C$1:$C$500,MATCH(\"Spe*\",$C$1:$C$500,0)+R134)))","v":""},{"$f":"IF(T133=\"\",\"\",IF(INDEX($C$1:$C$500,MATCH(\"Spe*\",$C$1:$C$500,0)+R134)=0,\"\",INDEX($D$1:$D$500,MATCH(\"Spe*\",$C$1:$C$500,0)+R134)))","v":""},10,"Chromashift10 [%]",-13,null,{"$error":"#N/A"},{"$error":"#N/A"},null,null,null,null,null,null,null,null,null,null,null,null,null,"v"]
["u'",0.1978,"u",0.22359999999999999,null,135,"","",11,"Chromashift11 [%]",0,null,{"$error":"#N/A"},{"$error":"#N/A"},null,null,null,135,"","",11,"Chromashift11 [%]",-6,null,{"$error":"#N/A"},{"$error":"#N/A"},null,null,null,null,null,null,null,null,null,null,null,null,null,"u'"]
["v'",0.47499999999999998,"v",0.34229999999999999,null,136,"","",12,"Chromashift12 [%]",0,null,{"$error":"#N/A"},{"$error":"#N/A"},null,null,null,136,"","",12,"Chromashift12 [%]",3,null,{"$error":"#N/A"},{"$error":"#N/A"},null,null,null,null,null,null,null,null,null,null,null,null,null,"v'"]
["PPFD",10.76,"PPFD",7.87,null,137,"","",13,"Chromashift13 [%]",0,null,{"$error":"#N/A"},{"$error":"#N/A"},null,null,null,137,"","",13,"Chromashift13 [%]",6,null,{"$error":"#N/A"},{"$error":"#N/A"},null,null,null,null,null,null,null,null,null,null,null,null,null,"PPFD"]
["PPFD_UV",0.2,"PPFD_UV",0.03,null,138,"","",14,"Chromashift14 [%]",0,null,{"$error":"#N/A"},{"$error":"#N/A"},null,null,null,138,"","",14,"Chromashift14 [%]",7,null,{"$error":"#N/A"},{"$error":"#N/A"},null,null,null,null,null,null,null,null,null,null,null,null,null,"PPFD_UV"]
["PPFD_Blau",3.09,"PPFD_Blau",1.6,null,139,"","",15,"Chromashift15 [%]",{"$f":"IF($A$1=\"\",NA(),INDEX($B$1:$B$300,MATCH(J139,$A$1:$A$300,0)))","v":0},null,{"$error":"#N/A"},{"$error":"#N/A"},null,null,null,139,"","",15,"Chromashift15 [%]",{"$f":"IF($C$1=\"\",NA(),INDEX($D$1:$D$300,MATCH(V139,$C$1:$C$300,0)))","v":1},null,{"$error":"#N/A"},{"$error":"#N/A"},null,null,null,null,null,null,null,null,null,null,null,null,null,"PPFD_Blau"]
["PPFD_Grün",3.97,"PPFD_Grün",3.44,null,140,"","",16,"Chromashift16 [%]",0,null,{"$error":"#N/A"},{"$error":"#N/A"},null,null,null,140,"","",16,"Chromashift16 [%]",-2,null,{"$error":"#N/A"},{"$error":"#N/A"},null,null,null,null,null,null,null,null,null,null,null,null,null,"PPFD_Grün"]
["PPFD_Rot",3.7,"PPFD_Rot",2.83,null,141,"","",null,null,null,null,{"$error":"#N/A"},{"$error":"#N/A"},null,null,null,141,"","",null,null,null,null,{"$error":"#N/A"},{"$error":"#N/A"},null,null,null,null,null,null,null,null,null,null,null,null,null,"PPFD_Rot"]
["PPFD_FR",3.26,"PPFD_FR",0.46,null,142,"","",null,"PPFD",{"$f":"IF($A$1=\"\",NA(),INDEX($B$1:$B$300,MATCH(J142,$A$1:$A$300,0)))","v":10.76},null,{"$error":"#N/A"},{"$error":"#N/A"},null,null,null,142,"","",null,"PPFD",{"$f":"IF($C$1=\"\",NA(),INDEX($D$1:$D$300,MATCH(V142,$C$1:$C$300,0)))","v":7.87},null,{"$error":"#N/A"},{"$error":"#N/A"},null,null,null,null,null,null,null,null,null,null,null,null,null,"PPFD_FR"]
["TLCI",100,"TLCI",59,null,143,"","",null,"PPFD_UV",{"$f":"IF($A$1=\"\",NA(),INDEX($B$1:$B$300,MATCH(J143,$A$1:$A$300,0)))","v":0.2},null,{"$error":"#N/A"},{"$error":"#N/A"},null,null,null,143,"","",null,"PPFD_UV",{"$f":"IF($C$1=\"\",NA(),INDEX($D$1:$D$300,MATCH(V143,$C$1:$C$300,0)))","v":0.03},null,{"$error":"#N/A"},{"$error":"#N/A"},null,null,null,null,null,null,null,null,null,null,null,null,null,"TLCI"]
["Q1",99,"Q1",87,null,144,"","",null,"PPFD_Blau",null,null,{"$error":"#N/A"},{"$error":"#N/A"},null,null,null,144,"","",null,"PPFD_Blau",null,null,{"$error":"#N/A"},{"$error":"#N/A"},null,null,null,null,null,null,null,null,null,null,null,null,null,"Q1"]
["Q2",99,"Q2",95,null,145,"","",null,"PPFD_Blue",{"$f":"IF(ISNA(MATCH(J144,$A$1:$A$300,0)),IF($A$1=\"\",NA(),INDEX($B$1:$B$300,MATCH(J145,$A$1:$A$300,0))),IF($A$1=\"\",NA(),INDEX($B$1:$B$300,MATCH(J144,$A$1:$A$300,0))))","v":3.09},null,{"$error":"#N/A"},{"$error":"#N/A"},null,null,null,145,"","",null,"PPFD_Blue",{"$f":"IF(ISNA(MATCH(V144,$C$1:$C$300,0)),IF($C$1=\"\",NA(),INDEX($D$1:$D$300,MATCH(V145,$C$1:$C$300,0))),IF($C$1=\"\",NA(),INDEX($D$1:$D$300,MATCH(V144,$C$1:$C$300,0))))","v":1.6},null,{"$error":"#N/A"},{"$error":"#N/A"},null,null,null,null,null,null,null,null,null,null,null,null,null,"Q2"]
["Q3",99,"Q3",95,null,146,"","",null,"PPFD_Grün",null,null,{"$error":"#N/A"},{"$error":"#N/A"},null,null,null,146,"","",null,"PPFD_Grün",null,null,{"$error":"#N/A"},{"$error":"#N/A"},null,null,null,null,null,null,null,null,null,null,null,null,null,"Q3"]
["Q4",99,"Q4",73,null,147,"","",null,"PPFD_Green",{"$f":"IF(ISNA(MATCH(J146,$A$1:$A$300,0)),IF($A$1=\"\",NA(),INDEX($B$1:$B$300,MATCH(J147,$A$1:$A$300,0))),IF($A$1=\"\",NA(),INDEX($B$1:$B$300,MATCH(J146,$A$1:$A$300,0))))","v":3.97},null,{"$error":"#N/A"},{"$error":"#N/A"},null,null,null,147,"","",null,"PPFD_Green",{"$f":"IF(ISNA(MATCH(V146,$C$1:$C$300,0)),IF($C$1=\"\",NA(),INDEX($D$1:$D$300,MATCH(V147,$C$1:$C$300,0))),IF($C$1=\"\",NA(),INDEX($D$1:$D$300,MATCH(V146,$C$1:$C$300,0))))","v":3.44},null,{"$error":"#N/A"},{"$error":"#N/A"},null,null,null,null,null,null,null,null,null,null,null,null,null,"Q4"]
["Q5",99,"Q5",55,null,148,"","",null,"PPFD_Rot",null,null,{"$error":"#N/A"},{"$error":"#N/A"},null,null,null,148,"","",null,"PPFD_Rot",null,null,{"$error":"#N/A"},{"$error":"#N/A"},null,null,null,null,null,null,null,null,null,null,null,null,null,"Q5"]
["Q6",99,"Q6",55,null,149,"","",null,"PPFD_Red",{"$f":"IF(ISNA(MATCH(J148,$A$1:$A$300,0)),IF($A$1=\"\",NA(),INDEX($B$1:$B$300,MATCH(J149,$A$1:$A$300,0))),IF($A$1=\"\",NA(),INDEX($B$1:$B$300,MATCH(J148,$A$1:$A$300,0))))","v":3.7},null,{"$error":"#N/A"},{"$error":"#N/A"},null,null,null,149,"","",null,"PPFD_Red",{"$f":"IF(ISNA(MATCH(V148,$C$1:$C$300,0)),IF($C$1=\"\",NA(),INDEX($D$1:$D$300,MATCH(V149,$C$1:$C$300,0))),IF($C$1=\"\",NA(),INDEX($D$1:$D$300,MATCH(V148,$C$1:$C$300,0))))","v":2.83},null,{"$error":"#N/A"},{"$error":"#N/A"},null,null,null,null,null,null,null,null,null,null,null,null,null,"Q6"]
["Q7",99,"Q7",99,null,150,"","",null,"PPFD_FR",{"$f":"IF($A$1=\"\",NA(),INDEX($B$1:$B$300,MATCH(J150,$A$1:$A$300,0)))","v":3.26},null,{"$error":"#N/A"},{"$error":"#N/A"},null,null,null,150,"","",null,"PPFD_FR",{"$f":"IF($C$1=\"\",NA(),INDEX($D$1:$D$300,MATCH(V150,$C$1:$C$300,0)))","v":0.46},null,{"$error":"#N/A"},{"$error":"#N/A"},null,null,null,null,null,null,null,null,null,null,null,null,null,"Q7"]
["Q8",99,"Q8",87,null,151,"","",null,null,null,null,{"$error":"#N/A"},{"$error":"#N/A"},null,null,null,151,"","",null,null,null,null,{"$error":"#N/A"},{"$error":"#N/A"},null,null,null,null,null,null,null,null,null,null,null,null,null,"Q8"]
["Q9",99,"Q9",90,null,152,"","",null,null,null,null,{"$error":"#N/A"},{"$error":"#N/A"},null,null,null,152,"","",null,null,null,null,{"$error":"#N/A"},{"$error":"#N/A"},null,null,null,null,null,null,null,null,null,null,null,null,null,"Q9"]
["Q10",99,"Q10",98,null,153,"","",null,null,null,null,{"$error":"#N/A"},{"$error":"#N/A"},null,null,null,153,"","",null,null,null,null,{"$error":"#N/A"},{"$error":"#N/A"},null,null,null,null,null,null,null,null,null,null,null,null,null,"Q10"]
["Q11",99,"Q11",34,null,154,"","",null,null,null,null,{"$error":"#N/A"},{"$error":"#N/A"},null,null,null,154,"","",null,null,null,null,{"$error":"#N/A"},{"$error":"#N/A"},null,null,null,null,null,null,null,null,null,null,null,null,null,"Q11"]
["Q12",99,"Q12",80,null,155,"","",null,null,null,null,{"$error":"#N/A"},{"$error":"#N/A"},null,null,null,155,"","",null,null,null,null,{"$error":"#N/A"},{"$error":"#N/A"},null,null,null,null,null,null,null,null,null,null,null,null,null,"Q12"]
["Q13",99,"Q13",42,null,156,"","",null,null,null,null,{"$error":"#N/A"},{"$error":"#N/A"},null,null,null,156,"","",null,null,null,null,{"$error":"#N/A"},{"$error":"#N/A"},null,null,null,null,null,null,null,null,null,null,null,null,null,"Q13"]
["Q14",99,"Q14",90,null,157,"","",null,null,null,null,{"$error":"#N/A"},{"$error":"#N/A"},null,null,null,157,"","",null,null,null,null,{"$error":"#N/A"},{"$error":"#N/A"},null,null,null,null,null,null,null,null,null,null,null,null,null,"Q14"]
["Q15",99,"Q15",60,null,158,"","",null,null,null,null,{"$error":"#N/A"},{"$error":"#N/A"},null,null,null,158,"","",null,null,null,null,{"$error":"#N/A"},{"$error":"#N/A"},null,null,null,null,null,null,null,null,null,null,null,null,null,"Q15"]
["Q16",99,"Q16",59,null,159,"","",null,null,null,null,{"$error":"#N/A"},{"$error":"#N/A"},null,null,null,159,"","",null,null,null,null,{"$error":"#N/A"},{"$error":"#N/A"},null,null,null,null,null,null,null,null,null,null,null,null,null,"Q16"]
["Q17",99,"Q17",63,null,160,"","",null,null,null,null,{"$error":"#N/A"},{"$error":"#N/A"},null,null,null,160,"","",null,null,null,null,{"$error":"#N/A"},{"$error":"#N/A"},null,null,null,null,null,null,null,null,null,null,null,null,null,"Q17"]
["Q18",99,"Q18",43,null,161,"","",null,null,null,null,{"$error":"#N/A"},{"$error":"#N/A"},null,null,null,161,"","",null,null,null,null,{"$error":"#N/A"},{"$error":"#N/A"},null,null,null,null,null,null,null,null,null,null,null,null,null,"Q18"]
["R Lightness",0,"R Lightness",4,null,162,"","",null,null,null,null,{"$error":"#N/A"},{"$error":"#N/A"},null,null,null,162,"","",null,null,null,null,{"$f":"IF(S162=\"\",NA(),ROUND(S162,0))","v":{"$error":"#N/A"}},{"$f":"IF(T162=\"\",NA(),T162)","v":{"$error":"#N/A"}},null,null,null,null,null,null,null,null,null,null,null,null,null,"R Lightness"]
["R Chroma",0,"R Chroma",2,null,163,"","",null,null,null,null,{"$error":"#N/A"},{"$error":"#N/A"},null,null,null,163,"","",null,null,null,null,{"$error":"#N/A"},{"$error":"#N/A"},null,null,null,null,null,null,null,null,null,null,null,null,null,"R Chroma"]
["R Hue",0,"R Hue",0,null,164,"","",null,null,null,null,{"$error":"#N/A"},{"$error":"#N/A"},null,null,null,164,"","",null,null,null,null,{"$error":"#N/A"},{"$error":"#N/A"},null,null,null,null,null,null,null,null,null,null,null,null,null,"R Hue"]
["R/Y Lightness",0,"R/Y Lightness",0,null,165,"","",null,null,null,null,{"$error":"#N/A"},{"$error":"#N/A"},null,null,null,165,"","",null,null,null,null,{"$error":"#N/A"},{"$error":"#N/A"},null,null,null,null,null,null,null,null,null,null,null,null,null,"R/Y Lightness"]
["R/Y Chroma",0,"R/Y Chroma",0,null,166,"","",null,null,null,null,{"$error":"#N/A"},{"$error":"#N/A"},null,null,null,166,"","",null,null,null,null,{"$error":"#N/A"},{"$error":"#N/A"},null,null,null,null,null,null,null,null,null,null,null,null,null,"R/Y Chroma"]
["R/Y Hue",0,"R/Y Hue",0,null,167,"","",null,null,null,null,{"$error":"#N/A"},{"$error":"#N/A"},null,null,null,167,"","",null,null,null,null,{"$error":"#N/A"},{"$error":"#N/A"},null,null,null,null,null,null,null,null,null,null,null,null,null,"R/Y Hue"]
["Y Lightness",0,"Y Lightness",-2,null,168,"","",null,null,null,null,{"$error":"#N/A"},{"$error":"#N/A"},null,null,null,168,"","",null,null,null,null,{"$error":"#N/A"},{"$error":"#N/A"},null,null,null,null,null,null,null,null,null,null,null,null,null,"Y Lightness"]
["Y Chroma",0,"Y Chroma",0,null,169,"","",null,null,null,null,{"$error":"#N/A"},{"$error":"#N/A"},null,null,null,169,"","",null,null,null,null,{"$error":"#N/A"},{"$error":"#N/A"},null,null,null,null,null,null,null,null,null,null,null,null,null,"Y Chroma"]
["Y Hue",0,"Y Hue",-5,null,170,"","",null,null,null,null,{"$error":"#N/A"},{"$error":"#N/A"},null,null,null,170,"","",null,null,null,null,{"$error":"#N/A"},{"$error":"#N/A"},null,null,null,null,null,null,null,null,null,null,null,null,null,"Y Hue"]
["Y/G Lightness",0,"Y/G Lightness",-2,null,171,"","",null,null,null,null,{"$error":"#N/A"},{"$error":"#N/A"},null,null,null,171,"","",null,null,null,null,{"$error":"#N/A"},{"$error":"#N/A"},null,null,null,null,null,null,null,null,null,null,null,null,null,"Y/G Lightness"]
["Y/G Chroma",0,"Y/G Chroma",-3,null,172,"","",null,null,null,null,{"$error":"#N/A"},{"$error":"#N/A"},null,null,null,172,"","",null,null,null,null,{"$error":"#N/A"},{"$error":"#N/A"},null,null,null,null,null,null,null,null,null,null,null,null,null,"Y/G Chroma"]
["Y/G Hue",0,"Y/G Hue",-2,null,173,"","",null,null,null,null,{"$error":"#N/A"},{"$error":"#N/A"},null,null,null,173,"","",null,null,null,null,{"$error":"#N/A"},{"$error":"#N/A"},null,null,null,null,null,null,null,null,null,null,null,null,null,"Y/G Hue"]
["G Lightness",0,"G Lightness",-3,null,174,"","",null,null,null,null,{"$error":"#N/A"},{"$error":"#N/A"},null,null,null,174,"","",null,null,null,null,{"$error":"#N/A"},{"$error":"#N/A"},null,null,null,null,null,null,null,null,null,null,null,null,null,"G Lightness"]
["G Chroma",0,"G Chroma",-3,null,175,"","",null,null,null,null,{"$error":"#N/A"},{"$error":"#N/A"},null,null,null,175,"","",null,null,null,null,{"$error":"#N/A"},{"$error":"#N/A"},null,null,null,null,null,null,null,null,null,null,null,null,null,"G Chroma"]
["G Hue",0,"G Hue",0,null,176,"","",null,null,null,null,{"$error":"#N/A"},{"$error":"#N/A"},null,null,null,176,"","",null,null,null,null,{"$error":"#N/A"},{"$error":"#N/A"},null,null,null,null,null,null,null,null,null,null,null,null,null,"G Hue"]
["G/C Lightness",0,"G/C Lightness",-3,null,177,"","",null,null,null,null,{"$error":"#N/A"},{"$error":"#N/A"},null,null,null,177,"","",null,null,null,null,{"$error":"#N/A"},{"$error":"#N/A"},null,null,null,null,null,null,null,null,null,null,null,null,null,"G/C Lightness"]
["G/C Chroma",0,"G/C Chroma",-3,null,178,"","",null,null,null,null,{"$error":"#N/A"},{"$error":"#N/A"},null,null,null,178,"","",null,null,null,null,{"$error":"#N/A"},{"$error":"#N/A"},null,null,null,null,null,null,null,null,null,null,null,null,null,"G/C Chroma"]
["G/C Hue",0,"G/C Hue",0,null,179,"","",null,null,null,null,{"$error":"#N/A"},{"$error":"#N/A"},null,null,null,179,"","",null,null,null,null,{"$error":"#N/A"},{"$error":"#N/A"},null,null,null,null,null,null,null,null,null,null,null,null,null,"G/C Hue"]
["C Lightness",0,"C Lightness",-3,null,180,"","",null,null,null,null,{"$error":"#N/A"},{"$error":"#N/A"},null,null,null,180,"","",null,null,null,null,{"$error":"#N/A"},{"$error":"#N/A"},null,null,null,null,null,null,null,null,null,null,null,null,null,"C Lightness"]
["C Chroma",0,"C Chroma",-3,null,181,"","",null,null,null,null,{"$error":"#N/A"},{"$error":"#N/A"},null,null,null,181,"","",null,null,null,null,{"$error":"#N/A"},{"$error":"#N/A"},null,null,null,null,null,null,null,null,null,null,null,null,null,"C Chroma"]
["C Hue",0,"C Hue",0,null,182,"","",null,null,null,null,{"$error":"#N/A"},{"$error":"#N/A"},null,null,null,182,"","",null,null,null,null,{"$error":"#N/A"},{"$error":"#N/A"},null,null,null,null,null,null,null,null,null,null,null,null,null,"C Hue"]
["C/B Lightness",0,"C/B Lightness",3,null,183,"","",null,null,null,null,{"$error":"#N/A"},{"$error":"#N/A"},null,null,null,183,"","",null,null,null,null,{"$error":"#N/A"},{"$error":"#N/A"},null,null,null,null,null,null,null,null,null,null,null,null,null,"C/B Lightness"]
["C/B Chroma",0,"C/B Chroma",0,null,184,"","",null,null,null,null,{"$error":"#N/A"},{"$error":"#N/A"},null,null,null,184,"","",null,null,null,null,{"$error":"#N/A"},{"$error":"#N/A"},null,null,null,null,null,null,null,null,null,null,null,null,null,"C/B Chroma"]
["C/B Hue",0,"C/B Hue",-5,null,185,"","",null,null,null,null,{"$error":"#N/A"},{"$error":"#N/A"},null,null,null,185,"","",null,null,null,null,{"$error":"#N/A"},{"$error":"#N/A"},null,null,null,null,null,null,null,null,null,null,null,null,null,"C/B Hue"]
["B Lightness",0,"B Lightness",1,null,186,"","",null,null,null,null,{"$error":"#N/A"},{"$error":"#N/A"},null,null,null,186,"","",null,null,null,null,{"$error":"#N/A"},{"$error":"#N/A"},null,null,null,null,null,null,null,null,null,null,null,null,null,"B Lightness"]
["B Chroma",0,"B Chroma",-1,null,187,"","",null,null,null,null,{"$error":"#N/A"},{"$error":"#N/A"},null,null,null,187,"","",null,null,null,null,{"$error":"#N/A"},{"$error":"#N/A"},null,null,null,null,null,null,null,null,null,null,null,null,null,"B Chroma"]
["B Hue",0,"B Hue",-2,null,188,"","",null,null,null,null,{"$error":"#N/A"},{"$error":"#N/A"},null,null,null,188,"","",null,null,null,null,{"$error":"#N/A"},{"$error":"#N/A"},null,null,null,null,null,null,null,null,null,null,null,null,null,"B Hue"]
["B/M Lightness",0,"B/M Lightness",3,null,189,"","",null,null,null,null,{"$error":"#N/A"},{"$error":"#N/A"},null,null,null,189,"","",null,null,null,null,{"$error":"#N/A"},{"$error":"#N/A"},null,null,null,null,null,null,null,null,null,null,null,null,null,"B/M Lightness"]
["B/M Chroma",0,"B/M Chroma",-2,null,190,"","",null,null,null,null,{"$error":"#N/A"},{"$error":"#N/A"},null,null,null,190,"","",null,null,null,null,{"$error":"#N/A"},{"$error":"#N/A"},null,null,null,null,null,null,null,null,null,null,null,null,null,"B/M Chroma"]
["B/M Hue",0,"B/M Hue",4,null,191,"","",null,null,null,null,{"$error":"#N/A"},{"$error":"#N/A"},null,null,null,191,"","",null,null,null,null,{"$error":"#N/A"},{"$error":"#N/A"},null,null,null,null,null,null,null,null,null,null,null,null,null,"B/M Hue"]
["M Lightness",0,"M Lightness",3,null,192,"","",null,null,null,null,{"$error":"#N/A"},{"$error":"#N/A"},null,null,null,192,"","",null,null,null,null,{"$error":"#N/A"},{"$error":"#N/A"},null,null,null,null,null,null,null,null,null,null,null,null,null,"M Lightness"]
["M Chroma",0,"M Chroma",-2,null,193,"","",null,null,null,null,{"$error":"#N/A"},{"$error":"#N/A"},null,null,null,193,"","",null,null,null,null,{"$error":"#N/A"},{"$error":"#N/A"},null,null,null,null,null,null,null,null,null,null,null,null,null,"M Chroma"]
["M Hue",0,"M Hue",4,null,194,"","",null,null,null,null,{"$f":"IF(G194=\"\",NA(),ROUND(G194,0))","v":{"$error":"#N/A"}},{"$f":"IF(H194=\"\",NA(),H194)","v":{"$error":"#N/A"}},null,null,null,194,"","",null,null,null,null,{"$error":"#N/A"},{"$error":"#N/A"},null,null,null,null,null,null,null,null,null,null,null,null,null,"M Hue"]
["M/R Lightness",0,"M/R Lightness",4,null,{"$f":"F194+1","v":195},"","",null,null,null,null,{"$error":"#N/A"},{"$error":"#N/A"},null,null,null,{"$f":"R194+1","v":195},"","",null,null,null,null,{"$error":"#N/A"},{"$error":"#N/A"},null,null,null,null,null,null,null,null,null,null,null,null,null,"M/R Lightness"]
["M/R Chroma",0,"M/R Chroma",0,null,196,"","",null,null,null,null,{"$error":"#N/A"},{"$error":"#N/A"},null,null,null,196,"","",null,null,null,null,{"$error":"#N/A"},{"$error":"#N/A"},null,null,null,null,null,null,null,null,null,null,null,null,null,"M/R Chroma"]
["M/R Hue",0,"M/R Hue",4,null,197,"","",null,null,null,null,{"$error":"#N/A"},{"$error":"#N/A"},null,null,null,197,"","",null,null,null,null,{"$error":"#N/A"},{"$error":"#N/A"},null,null,null,null,null,null,null,null,null,null,null,null,null,"M/R Hue"]
["Lambda Peak [nm]",459,"Lambda Peak [nm]",544,null,198,{"$f":"IF(G197=\"\",\"\",IF(INDEX($A$1:$A$500,MATCH(\"Spe*\",$A$1:$A$500,0)+F198)=0,\"\",INDEX($A$1:$A$500,MATCH(\"Spe*\",$A$1:$A$500,0)+F198)))","v":""},{"$f":"IF(H197=\"\",\"\",IF(INDEX($A$1:$A$500,MATCH(\"Spe*\",$A$1:$A$500,0)+F198)=0,\"\",INDEX($B$1:$B$500,MATCH(\"Spe*\",$A$1:$A$500,0)+F198)))","v":""},null,null,null,null,{"$error":"#N/A"},{"$error":"#N/A"},null,null,null,198,{"$f":"IF(S197=\"\",\"\",IF(INDEX($C$1:$C$500,MATCH(\"Spe*\",$C$1:$C$500,0)+R198)=0,\"\",INDEX($C$1:$C$500,MATCH(\"Spe*\",$C$1:$C$500,0)+R198)))","v":""},{"$f":"IF(T197=\"\",\"\",IF(INDEX($C$1:$C$500,MATCH(\"Spe*\",$C$1:$C$500,0)+R198)=0,\"\",INDEX($D$1:$D$500,MATCH(\"Spe*\",$C$1:$C$500,0)+R198)))","v":""},null,null,null,null,{"$error":"#N/A"},{"$error":"#N/A"},null,null,null,null,null,null,null,null,null,null,null,null,null,"Lambda Peak [nm]"]
["Lambda Peak",9.5434199999999993,"Lambda Peak",33.226990000000001,null,199,"","",null,null,null,null,{"$error":"#N/A"},{"$error":"#N/A"},null,null,null,199,"","",null,null,null,null,{"$error":"#N/A"},{"$error":"#N/A"},null,null,null,null,null,null,null,null,null,null,null,null,null,"Lambda Peak"]
["Farbreinheit [%]",4.5999999999999996,"Farbreinheit [%]",38,null,200,"","",null,null,null,null,{"$error":"#N/A"},{"$error":"#N/A"},null,null,null,200,"","",null,null,null,null,{"$error":"#N/A"},{"$error":"#N/A"},null,null,null,null,null,null,null,null,null,null,null,null,null,"Farbreinheit [%]"]
["Dominante Wellenlänge [nm]",495,"Dominante Wellenlänge [nm]",576,null,201,"","",null,null,null,null,{"$error":"#N/A"},{"$error":"#N/A"},null,null,null,201,"","",null,null,null,null,{"$error":"#N/A"},{"$error":"#N/A"},null,null,null,null,null,null,null,null,null,null,null,null,null,"Dominante Wellenlänge [nm]"]
[null,null,null,null,null,202,"","",null,null,null,null,{"$error":"#N/A"},{"$error":"#N/A"},null,null,null,202,"","",null,null,null,null,{"$error":"#N/A"},{"$error":"#N/A"}]
["Auflösung",null,"Auflösung","5 nm",null,203,"","",null,null,null,null,{"$error":"#N/A"},{"$error":"#N/A"},null,null,null,203,"","",null,null,null,null,{"$error":"#N/A"},{"$error":"#N/A"},null,null,null,null,null,null,null,null,null,null,null,null,null,"Auflösung"]
["Spektrum in [nm]",null,"Spektrum in [nm]","mW/m²/nm",null,204,"","",null,null,null,null,{"$error":"#N/A"},{"$error":"#N/A"},null,null,null,204,"","",null,null,null,null,{"$error":"#N/A"},{"$error":"#N/A"},null,null,null,null,null,null,null,null,null,null,null,null,null,"Spektrum in [nm]"]
[380,2.2667820000000001,380,0.16852,null,205,"","",null,null,null,null,{"$error":"#N/A"},{"$error":"#N/A"},null,null,null,205,"","",null,null,null,null,{"$error":"#N/A"},{"$error":"#N/A"},null,null,null,null,null,null,null,null,null,null,null,null,null,380]
[385,2.4779659999999999,385,8.1559999999999994E-2,null,206,"","",null,null,null,null,{"$error":"#N/A"},{"$error":"#N/A"},null,null,null,206,"","",null,null,null,null,{"$error":"#N/A"},{"$error":"#N/A"},null,null,null,null,null,null,null,null,null,null,null,null,null,385]
[390,2.8305609999999999,390,0.13952999999999999,null,207,"","",null,null,null,null,{"$error":"#N/A"},{"$error":"#N/A"},null,null,null,207,"","",null,null,null,null,{"$error":"#N/A"},{"$error":"#N/A"},null,null,null,null,null,null,null,null,null,null,null,null,null,390]
[395,3.3971849999999999,395,0.22821,null,208,"","",null,null,null,null,{"$error":"#N/A"},{"$error":"#N/A"},null,null,null,208,"","",null,null,null,null,{"$error":"#N/A"},{"$error":"#N/A"},null,null,null,null,null,null,null,null,null,null,null,null,null,395]
[400,4.636063,400,1.38337,null,209,"","",null,null,null,null,{"$error":"#N/A"},{"$error":"#N/A"},null,null,null,209,"","",null,null,null,null,{"$error":"#N/A"},{"$error":"#N/A"},null,null,null,null,null,null,null,null,null,null,null,null,null,400]
[405,5.7536860000000001,405,2.7577099999999999,null,210,"","",null,null,null,null,{"$error":"#N/A"},{"$error":"#N/A"},null,null,null,210,"","",null,null,null,null,{"$error":"#N/A"},{"$error":"#N/A"},null,null,null,null,null,null,null,null,null,null,null,null,null,405]
[410,6.132161,410,1.68282,null,211,"","",null,null,null,null,{"$error":"#N/A"},{"$error":"#N/A"},null,null,null,211,"","",null,null,null,null,{"$error":"#N/A"},{"$error":"#N/A"},null,null,null,null,null,null,null,null,null,null,null,null,null,410]
[415,6.7396719999999997,415,0.97008000000000005,null,212,"","",null,null,null,null,{"$error":"#N/A"},{"$error":"#N/A"},null,null,null,212,"","",null,null,null,null,{"$error":"#N/A"},{"$error":"#N/A"},null,null,null,null,null,null,null,null,null,null,null,null,null,415]
[420,6.9245169999999998,420,1.27929,null,213,"","",null,null,null,null,{"$error":"#N/A"},{"$error":"#N/A"},null,null,null,213,"","",null,null,null,null,{"$error":"#N/A"},{"$error":"#N/A"},null,null,null,null,null,null,null,null,null,null,null,null,null,420]
[425,6.8936270000000004,425,1.76498,null,214,"","",null,null,null,null,{"$error":"#N/A"},{"$error":"#N/A"},null,null,null,214,"","",null,null,null,null,{"$error":"#N/A"},{"$error":"#N/A"},null,null,null,null,null,null,null,null,null,null,null,null,null,425]
[430,6.7464190000000004,430,4.5263799999999996,null,215,"","",null,null,null,null,{"$error":"#N/A"},{"$error":"#N/A"},null,null,null,215,"","",null,null,null,null,{"$error":"#N/A"},{"$error":"#N/A"},null,null,null,null,null,null,null,null,null,null,null,null,null,430]
[435,7.1653640000000003,435,10.789669999999999,null,216,"","",null,null,null,null,{"$error":"#N/A"},{"$error":"#N/A"},null,null,null,216,"","",null,null,null,null,{"$error":"#N/A"},{"$error":"#N/A"},null,null,null,null,null,null,null,null,null,null,null,null,null,435]
[440,7.857132,440,8.2623499999999996,null,217,"","",null,null,null,null,{"$error":"#N/A"},{"$error":"#N/A"},null,null,null,217,"","",null,null,null,null,{"$error":"#N/A"},{"$error":"#N/A"},null,null,null,null,null,null,null,null,null,null,null,null,null,440]
[445,8.4695160000000005,445,3.3389000000000002,null,218,"","",null,null,null,null,{"$error":"#N/A"},{"$error":"#N/A"},null,null,null,218,"","",null,null,null,null,{"$error":"#N/A"},{"$error":"#N/A"},null,null,null,null,null,null,null,null,null,null,null,null,null,445]
[450,9.0620759999999994,450,3.2912599999999999,null,219,"","",null,null,null,null,{"$error":"#N/A"},{"$error":"#N/A"},null,null,null,219,"","",null,null,null,null,{"$error":"#N/A"},{"$error":"#N/A"},null,null,null,null,null,null,null,null,null,null,null,null,null,450]
[455,9.3851980000000008,455,3.2295199999999999,null,220,"","",null,null,null,null,{"$error":"#N/A"},{"$error":"#N/A"},null,null,null,220,"","",null,null,null,null,{"$error":"#N/A"},{"$error":"#N/A"},null,null,null,null,null,null,null,null,null,null,null,null,null,455]
[460,9.541563,460,3.1371699999999998,null,221,"","",null,null,null,null,{"$error":"#N/A"},{"$error":"#N/A"},null,null,null,221,"","",null,null,null,null,{"$error":"#N/A"},{"$error":"#N/A"},null,null,null,null,null,null,null,null,null,null,null,null,null,460]
[465,9.4470469999999995,465,2.9052099999999998,null,222,"","",null,null,null,null,{"$error":"#N/A"},{"$error":"#N/A"},null,null,null,222,"","",null,null,null,null,{"$error":"#N/A"},{"$error":"#N/A"},null,null,null,null,null,null,null,null,null,null,null,null,null,465]
[470,9.3762030000000003,470,2.7472099999999999,null,223,"","",null,null,null,null,{"$error":"#N/A"},{"$error":"#N/A"},null,null,null,223,"","",null,null,null,null,{"$error":"#N/A"},{"$error":"#N/A"},null,null,null,null,null,null,null,null,null,null,null,null,null,470]
[475,9.4019049999999993,475,2.6691099999999999,null,224,"","",null,null,null,null,{"$error":"#N/A"},{"$error":"#N/A"},null,null,null,224,"","",null,null,null,null,{"$error":"#N/A"},{"$error":"#N/A"},null,null,null,null,null,null,null,null,null,null,null,null,null,475]
[480,9.3887429999999998,480,3.9504299999999999,null,225,"","",null,null,null,null,{"$error":"#N/A"},{"$error":"#N/A"},null,null,null,225,"","",null,null,null,null,{"$error":"#N/A"},{"$error":"#N/A"},null,null,null,null,null,null,null,null,null,null,null,null,null,480]
[485,9.1542910000000006,485,7.5335799999999997,null,226,"","",null,null,null,null,{"$error":"#N/A"},{"$error":"#N/A"},null,null,null,226,"","",null,null,null,null,{"$f":"IF(S226=\"\",NA(),ROUND(S226,0))","v":{"$error":"#N/A"}},{"$f":"IF(T226=\"\",NA(),T226)","v":{"$error":"#N/A"}},null,null,null,null,null,null,null,null,null,null,null,null,null,485]
[490,9.0290510000000008,490,8.9959799999999994,null,227,"","",null,null,null,null,{"$error":"#N/A"},{"$error":"#N/A"},null,null,null,227,"","",null,null,null,null,{"$error":"#N/A"},{"$error":"#N/A"},null,null,null,null,null,null,null,null,null,null,null,null,null,490]
[495,9.1911369999999994,495,6.7081299999999997,null,228,"","",null,null,null,null,{"$error":"#N/A"},{"$error":"#N/A"},null,null,null,228,"","",null,null,null,null,{"$error":"#N/A"},{"$error":"#N/A"},null,null,null,null,null,null,null,null,null,null,null,null,null,495]
[500,9.1107759999999995,500,3.7833800000000002,null,229,"","",null,null,null,null,{"$error":"#N/A"},{"$error":"#N/A"},null,null,null,229,"","",null,null,null,null,{"$error":"#N/A"},{"$error":"#N/A"},null,null,null,null,null,null,null,null,null,null,null,null,null,500]
[505,9.1073210000000007,505,2.0131100000000002,null,230,"","",null,null,null,null,{"$error":"#N/A"},{"$error":"#N/A"},null,null,null,230,"","",null,null,null,null,{"$error":"#N/A"},{"$error":"#N/A"},null,null,null,null,null,null,null,null,null,null,null,null,null,505]
[510,9.0491340000000005,510,1.4522600000000001,null,231,"","",null,null,null,null,{"$error":"#N/A"},{"$error":"#N/A"},null,null,null,231,"","",null,null,null,null,{"$error":"#N/A"},{"$error":"#N/A"},null,null,null,null,null,null,null,null,null,null,null,null,null,510]
[515,8.8924649999999996,515,1.3143800000000001,null,232,"","",null,null,null,null,{"$error":"#N/A"},{"$error":"#N/A"},null,null,null,232,"","",null,null,null,null,{"$error":"#N/A"},{"$error":"#N/A"},null,null,null,null,null,null,null,null,null,null,null,null,null,515]
[520,8.797625,520,1.2144600000000001,null,233,"","",null,null,null,null,{"$error":"#N/A"},{"$error":"#N/A"},null,null,null,233,"","",null,null,null,null,{"$error":"#N/A"},{"$error":"#N/A"},null,null,null,null,null,null,null,null,null,null,null,null,null,520]
[525,8.9894829999999999,525,1.3413900000000001,null,234,"","",null,null,null,null,{"$error":"#N/A"},{"$error":"#N/A"},null,null,null,234,"","",null,null,null,null,{"$error":"#N/A"},{"$error":"#N/A"},null,null,null,null,null,null,null,null,null,null,null,null,null,525]
[530,9.1116259999999993,530,2.30227,null,235,"","",null,null,null,null,{"$error":"#N/A"},{"$error":"#N/A"},null,null,null,235,"","",null,null,null,null,{"$error":"#N/A"},{"$error":"#N/A"},null,null,null,null,null,null,null,null,null,null,null,null,null,530]
[535,9.1910430000000005,535,7.0855699999999997,null,236,"","",null,null,null,null,{"$error":"#N/A"},{"$error":"#N/A"},null,null,null,236,"","",null,null,null,null,{"$error":"#N/A"},{"$error":"#N/A"},null,null,null,null,null,null,null,null,null,null,null,null,null,535]
[540,9.068149,540,22.755669999999999,null,237,"","",null,null,null,null,{"$error":"#N/A"},{"$error":"#N/A"},null,null,null,237,"","",null,null,null,null,{"$error":"#N/A"},{"$error":"#N/A"},null,null,null,null,null,null,null,null,null,null,null,null,null,540]
[545,9.0134760000000007,545,32.732309999999998,null,238,"","",null,null,null,null,{"$error":"#N/A"},{"$error":"#N/A"},null,null,null,238,"","",null,null,null,null,{"$error":"#N/A"},{"$error":"#N/A"},null,null,null,null,null,null,null,null,null,null,null,null,null,545]
[550,9.0122099999999996,550,20.21733,null,239,"","",null,null,null,null,{"$error":"#N/A"},{"$error":"#N/A"},null,null,null,239,"","",null,null,null,null,{"$error":"#N/A"},{"$error":"#N/A"},null,null,null,null,null,null,null,null,null,null,null,null,null,550]
[555,8.8750739999999997,555,7.17197,null,240,"","",null,null,null,null,{"$error":"#N/A"},{"$error":"#N/A"},null,null,null,240,"","",null,null,null,null,{"$error":"#N/A"},{"$error":"#N/A"},null,null,null,null,null,null,null,null,null,null,null,null,null,555]
[560,8.7053999999999991,560,2.5609999999999999,null,241,"","",null,null,null,null,{"$error":"#N/A"},{"$error":"#N/A"},null,null,null,241,"","",null,null,null,null,{"$error":"#N/A"},{"$error":"#N/A"},null,null,null,null,null,null,null,null,null,null,null,null,null,560]
[565,8.4653109999999998,565,1.50362,null,242,"","",null,null,null,null,{"$error":"#N/A"},{"$error":"#N/A"},null,null,null,242,"","",null,null,null,null,{"$error":"#N/A"},{"$error":"#N/A"},null,null,null,null,null,null,null,null,null,null,null,null,null,565]
[570,8.3170359999999999,570,1.9446399999999999,null,243,"","",null,null,null,null,{"$error":"#N/A"},{"$error":"#N/A"},null,null,null,243,"","",null,null,null,null,{"$error":"#N/A"},{"$error":"#N/A"},null,null,null,null,null,null,null,null,null,null,null,null,null,570]
[575,8.1715920000000004,575,4.2584400000000002,null,244,"","",null,null,null,null,{"$error":"#N/A"},{"$error":"#N/A"},null,null,null,244,"","",null,null,null,null,{"$error":"#N/A"},{"$error":"#N/A"},null,null,null,null,null,null,null,null,null,null,null,null,null,575]
[580,8.1001600000000007,580,7.9811199999999998,null,245,"","",null,null,null,null,{"$error":"#N/A"},{"$error":"#N/A"},null,null,null,245,"","",null,null,null,null,{"$error":"#N/A"},{"$error":"#N/A"},null,null,null,null,null,null,null,null,null,null,null,null,null,580]
[585,8.0237320000000008,585,10.12635,null,246,"","",null,null,null,null,{"$error":"#N/A"},{"$error":"#N/A"},null,null,null,246,"","",null,null,null,null,{"$error":"#N/A"},{"$error":"#N/A"},null,null,null,null,null,null,null,null,null,null,null,null,null,585]
[590,7.7804159999999998,590,9.0343300000000006,null,247,"","",null,null,null,null,{"$error":"#N/A"},{"$error":"#N/A"},null,null,null,247,"","",null,null,null,null,{"$error":"#N/A"},{"$error":"#N/A"},null,null,null,null,null,null,null,null,null,null,null,null,null,590]
[595,7.7598640000000003,595,6.4294599999999997,null,248,"","",null,null,null,null,{"$error":"#N/A"},{"$error":"#N/A"},null,null,null,248,"","",null,null,null,null,{"$error":"#N/A"},{"$error":"#N/A"},null,null,null,null,null,null,null,null,null,null,null,null,null,595]
[600,7.767684,600,5.6601299999999997,null,249,"","",null,null,null,null,{"$error":"#N/A"},{"$error":"#N/A"},null,null,null,249,"","",null,null,null,null,{"$error":"#N/A"},{"$error":"#N/A"},null,null,null,null,null,null,null,null,null,null,null,null,null,600]
[605,7.731814,605,10.57896,null,250,"","",null,null,null,null,{"$error":"#N/A"},{"$error":"#N/A"},null,null,null,250,"","",null,null,null,null,{"$error":"#N/A"},{"$error":"#N/A"},null,null,null,null,null,null,null,null,null,null,null,null,null,605]
[610,7.6200130000000001,610,22.982099999999999,null,251,"","",null,null,null,null,{"$error":"#N/A"},{"$error":"#N/A"},null,null,null,251,"","",null,null,null,null,{"$error":"#N/A"},{"$error":"#N/A"},null,null,null,null,null,null,null,null,null,null,null,null,null,610]
[615,7.4500609999999998,615,22.818090000000002,null,252,"","",null,null,null,null,{"$error":"#N/A"},{"$error":"#N/A"},null,null,null,252,"","",null,null,null,null,{"$error":"#N/A"},{"$error":"#N/A"},null,null,null,null,null,null,null,null,null,null,null,null,null,615]
[620,7.3865400000000001,620,12.559049999999999,null,253,"","",null,null,null,null,{"$error":"#N/A"},{"$error":"#N/A"},null,null,null,253,"","",null,null,null,null,{"$error":"#N/A"},{"$error":"#N/A"},null,null,null,null,null,null,null,null,null,null,null,null,null,620]
[625,7.2048059999999996,625,8.2346599999999999,null,254,"","",null,null,null,null,{"$error":"#N/A"},{"$error":"#N/A"},null,null,null,254,"","",null,null,null,null,{"$error":"#N/A"},{"$error":"#N/A"},null,null,null,null,null,null,null,null,null,null,null,null,null,625]
[630,7.0726630000000004,630,6.0498500000000002,null,255,"","",null,null,null,null,{"$error":"#N/A"},{"$error":"#N/A"},null,null,null,255,"","",null,null,null,null,{"$error":"#N/A"},{"$error":"#N/A"},null,null,null,null,null,null,null,null,null,null,null,null,null,630]
[635,7.0878990000000002,635,3.66927,null,256,"","",null,null,null,null,{"$error":"#N/A"},{"$error":"#N/A"},null,null,null,256,"","",null,null,null,null,{"$error":"#N/A"},{"$error":"#N/A"},null,null,null,null,null,null,null,null,null,null,null,null,null,635]
[640,7.0419169999999998,640,1.92031,null,257,"","",null,null,null,null,{"$error":"#N/A"},{"$error":"#N/A"},null,null,null,257,"","",null,null,null,null,{"$error":"#N/A"},{"$error":"#N/A"},null,null,null,null,null,null,null,null,null,null,null,null,null,640]
[645,6.8986169999999998,645,1.82274,null,258,"","",null,null,null,null,{"$f":"IF(G258=\"\",NA(),ROUND(G258,0))","v":{"$error":"#N/A"}},{"$f":"IF(H258=\"\",NA(),H258)","v":{"$error":"#N/A"}},null,null,null,258,"","",null,null,null,null,{"$error":"#N/A"},{"$error":"#N/A"},null,null,null,null,null,null,null,null,null,null,null,null,null,645]
[650,6.7647389999999996,650,1.9939499999999999,null,null,null,null,null,null,null,null,null,null,null,null,null,null,null,null,null,null,null,null,null,null,null,null,null,null,null,null,null,null,null,null,null,null,null,650]
[655,6.6299609999999998,655,1.7634399999999999,null,null,null,null,null,null,null,null,null,null,null,null,null,null,null,null,null,null,null,null,null,null,null,null,null,null,null,null,null,null,null,null,null,null,null,655]
[660,6.6271659999999999,660,1.52664,null,1,{"$f":"INDEX($A$200:$A$1200,MATCH(\"t in*\",$A$200:$A$1200,0)+F261)","v":0},{"$f":"INDEX($B$200:$B$1200,MATCH(\"t in*\",$A$200:$A$1200,0)+F261)","v":732},null,null,null,null,null,null,null,null,null,1,{"$f":"INDEX($C$1:$C$500,MATCH(\"t in*\",$C$1:$C$500,0)+R258)","v":{"$error":"#REF!"}},{"$f":"INDEX($D$1:$D$500,MATCH(\"t in*\",$C$1:$C$500,0)+R258)","v":{"$error":"#REF!"}},null,null,null,null,null,null,null,null,null,null,null,null,null,null,null,null,null,null,null,660]
[665,6.706842,665,1.48909,null,{"$f":"F261+1","v":2},{"$f":"INDEX($A$200:$A$1200,MATCH(\"t in*\",$A$200:$A$1200,0)+F262)","v":0.125},{"$f":"INDEX($B$200:$B$1200,MATCH(\"t in*\",$A$200:$A$1200,0)+F262)","v":731},null,null,null,null,null,null,null,null,null,{"$f":"R261+1","v":2},{"$f":"INDEX($C$1:$C$500,MATCH(\"t in*\",$C$1:$C$500,0)+R259)","v":"t in [ms]"},{"$f":"INDEX($D$1:$D$500,MATCH(\"t in*\",$C$1:$C$500,0)+R259)","v":"E in [lx]"},null,null,null,null,null,null,null,null,null,null,null,null,null,null,null,null,null,null,null,665]
[670,6.6757350000000004,670,1.36496,null,{"$f":"F262+1","v":3},0.25,731,null,null,null,null,null,null,null,null,null,{"$f":"R262+1","v":3},"t in [ms]",{"$f":"INDEX($D$1:$D$500,MATCH(\"t in*\",$C$1:$C$500,0)+R260)","v":"E in [lx]"},null,null,null,null,null,null,null,null,null,null,null,null,null,null,null,null,null,null,null,670]
[675,6.5624269999999996,675,1.2158599999999999,null,4,0.375,731,null,null,null,null,null,null,null,null,null,4,0,614.86400000000003,null,null,null,null,null,null,null,null,null,null,null,null,null,null,null,null,null,null,null,675]
[680,6.3496920000000001,680,1.29491,null,5,0.5,732,null,null,null,null,null,null,null,null,null,5,0.125,627.49099999999999,null,null,null,null,null,null,null,null,null,null,null,null,null,null,null,null,null,null,null,680]
[685,5.9583259999999996,685,1.2431700000000001,null,6,0.625,731,null,null,null,null,null,null,null,null,null,6,0.25,636.26,null,null,null,null,null,null,null,null,null,null,null,null,null,null,null,null,null,null,null,685]
[690,5.7667929999999998,690,1.2886299999999999,null,7,0.75,731,null,null,null,null,null,null,null,null,null,7,0.375,649.58900000000006,null,null,null,null,null,null,null,null,null,null,null,null,null,null,null,null,null,null,null,690]
[695,6.0055940000000003,695,1.11232,null,8,0.875,731,null,null,null,null,null,null,null,null,null,8,0.5,654.49900000000002,null,null,null,null,null,null,null,null,null,null,null,null,null,null,null,null,null,null,null,695]
[700,6.2686070000000003,700,1.27946,null,9,1,731,null,null,null,null,null,null,null,null,null,9,0.625,668.178,null,null,null,null,null,null,null,null,null,null,null,null,null,null,null,null,null,null,null,700]
[705,6.4813590000000003,705,2.5384899999999999,null,10,1.125,731,null,null,null,null,null,null,null,null,null,10,0.75,677.298,null,null,null,null,null,null,null,null,null,null,null,null,null,null,null,null,null,null,null,705]
[710,6.5850799999999996,710,2.9487100000000002,null,11,1.25,731,null,null,null,null,null,null,null,null,null,11,0.875,681.85799999999995,null,null,null,null,null,null,null,null,null,null,null,null,null,null,null,null,null,null,null,710]
[715,6.3130559999999996,715,1.94228,null,12,1.375,731,null,null,null,null,null,null,null,null,null,12,1,691.67899999999997,null,null,null,null,null,null,null,null,null,null,null,null,null,null,null,null,null,null,null,715]
[720,6.0558719999999999,720,0.82393000000000005,null,13,1.5,731,null,null,null,null,null,null,null,null,null,13,1.125,706.41,null,null,null,null,null,null,null,null,null,null,null,null,null,null,null,null,null,null,null,720]
[725,6.1839829999999996,725,0.58525000000000005,null,14,1.625,732,null,null,null,null,null,null,null,null,null,14,1.25,711.32100000000003,null,null,null,null,null,null,null,null,null,null,null,null,null,null,null,null,null,null,null,725]
[730,6.6153399999999998,730,0.51885000000000003,null,15,1.75,731,null,null,null,null,null,null,null,null,null,15,1.375,716.23099999999999,null,null,null,null,null,null,null,null,null,null,null,null,null,null,null,null,null,null,null,730]
[735,7.1217439999999996,735,0.55154000000000003,null,16,1.875,731,null,null,null,null,null,null,null,null,null,16,1.5,721.14200000000005,null,null,null,null,null,null,null,null,null,null,null,null,null,null,null,null,null,null,null,735]
[740,7.4515640000000003,740,0.59487999999999996,null,17,2,732,null,null,null,null,null,null,null,null,null,17,1.625,730.96299999999997,null,null,null,null,null,null,null,null,null,null,null,null,null,null,null,null,null,null,null,740]
[745,7.6437429999999997,745,0.63714999999999999,null,18,2.125,731,null,null,null,null,null,null,null,null,null,18,1.75,741.48500000000001,null,null,null,null,null,null,null,null,null,null,null,null,null,null,null,null,null,null,null,745]
[750,7.5227430000000002,750,0.58233999999999997,null,19,2.25,731,null,null,null,null,null,null,null,null,null,19,1.875,746.39599999999996,null,null,null,null,null,null,null,null,null,null,null,null,null,null,null,null,null,null,null,750]
[755,6.6333419999999998,755,0.51898999999999995,null,20,2.375,731,null,null,null,null,null,null,null,null,null,20,2,746.39599999999996,null,null,null,null,null,null,null,null,null,null,null,null,null,null,null,null,null,null,null,755]
[760,5.164568,760,0.53081999999999996,null,21,2.5,731,null,null,null,null,null,null,null,null,null,21,2.125,752.00800000000004,null,null,null,null,null,null,null,null,null,null,null,null,null,null,null,null,null,null,null,760]
[765,5.1724899999999998,765,0.35544999999999999,null,{"$f":"F281+1","v":22},2.625,731,null,null,null,null,null,null,null,null,null,22,2.25,752.00800000000004,null,null,null,null,null,null,null,null,null,null,null,null,null,null,null,null,null,null,null,765]
[770,6.4865500000000003,770,0.53188000000000002,null,23,2.75,732,null,null,null,null,null,null,null,null,null,23,2.375,756.91800000000001,null,null,null,null,null,null,null,null,null,null,null,null,null,null,null,null,null,null,null,770]
[775,7.1510049999999996,775,0.43961,null,24,2.875,731,null,null,null,null,null,null,null,null,null,24,2.5,756.91800000000001,null,null,null,null,null,null,null,null,null,null,null,null,null,null,null,null,null,null,null,775]
[780,7.1717950000000004,780,0.55608000000000002,null,25,3,731,null,null,null,null,null,null,null,null,null,25,2.625,756.91800000000001,null,null,null,null,null,null,null,null,null,null,null,null,null,null,null,null,null,null,null,780]
[null,null,null,null,null,26,3.125,731,null,null,null,null,null,null,null,null,null,26,2.75,752.00800000000004]
["Flickerverlauf",null,"Flickerverlauf",null,null,27,3.25,731,null,null,null,null,null,null,null,null,null,27,2.875,752.00800000000004,null,null,null,null,null,null,null,null,null,null,null,null,null,null,null,null,null,null,null,"Flickerverlauf"]
["t in [ms]",null,"t in [ms]","E in [lx]",null,28,3.375,731,null,null,null,null,null,null,null,null,null,28,3,746.39599999999996,null,null,null,null,null,null,null,null,null,null,null,null,null,null,null,null,null,null,null,"t in [ms]"]
[0,732,0,614.86400000000003,null,29,3.5,731,null,null,null,null,null,null,null,null,null,29,3.125,746.39599999999996,null,null,null,null,null,null,null,null,null,null,null,null,null,null,null,null,null,null,null,0]
[0.125,731,0.125,627.49099999999999,null,30,3.625,732,null,null,null,null,null,null,null,null,null,30,3.25,736.57500000000005,null,null,null,null,null,null,null,null,null,null,null,null,null,null,null,null,null,null,null,0.125]
[0.25,731,0.25,636.26,null,31,3.75,731,null,null,null,null,null,null,null,null,null,31,3.375,726.05200000000002,null,null,null,null,null,null,null,null,null,null,null,null,null,null,null,null,null,null,null,0.25]
[0.375,731,0.375,649.58900000000006,null,32,3.875,732,null,null,null,null,null,null,null,null,null,32,3.5,721.14200000000005,null,null,null,null,null,null,null,null,null,null,null,null,null,null,null,null,null,null,null,0.375]
[0.5,732,0.5,654.49900000000002,null,33,4,731,null,null,null,null,null,null,null,null,null,33,3.625,716.23099999999999,null,null,null,null,null,null,null,null,null,null,null,null,null,null,null,null,null,null,null,0.5]
[0.625,731,0.625,668.178,null,34,4.125,731,null,null,null,null,null,null,null,null,null,34,3.75,701.5,null,null,null,null,null,null,null,null,null,null,null,null,null,null,null,null,null,null,null,0.625]
[0.75,731,0.75,677.298,null,35,4.25,731,null,null,null,null,null,null,null,null,null,35,3.875,691.67899999999997,null,null,null,null,null,null,null,null,null,null,null,null,null,null,null,null,null,null,null,0.75]
[0.875,731,0.875,681.85799999999995,null,36,4.375,731,null,null,null,null,null,null,null,null,null,36,4,681.85799999999995,null,null,null,null,null,null,null,null,null,null,null,null,null,null,null,null,null,null,null,0.875]
[1,731,1,691.67899999999997,null,37,4.5,731,null,null,null,null,null,null,null,null,null,37,4.125,672.73800000000006,null,null,null,null,null,null,null,null,null,null,null,null,null,null,null,null,null,null,null,1]
[1.125,731,1.125,706.41,null,38,4.625,731,null,null,null,null,null,null,null,null,null,38,4.25,663.61900000000003,null,null,null,null,null,null,null,null,null,null,null,null,null,null,null,null,null,null,null,1.125]
[1.25,731,1.25,711.32100000000003,null,39,4.75,731,null,null,null,null,null,null,null,null,null,39,4.375,649.58900000000006,null,null,null,null,null,null,null,null,null,null,null,null,null,null,null,null,null,null,null,1.25]
[1.375,731,1.375,716.23099999999999,null,40,4.875,731,null,null,null,null,null,null,null,null,null,40,4.5,641.17100000000005,null,null,null,null,null,null,null,null,null,null,null,null,null,null,null,null,null,null,null,1.375]
[1.5,731,1.5,721.14200000000005,null,41,5,730,null,null,null,null,null,null,null,null,null,41,4.625,627.49099999999999,null,null,null,null,null,null,null,null,null,null,null,null,null,null,null,null,null,null,null,1.5]
[1.625,732,1.625,730.96299999999997,null,42,5.125,731,null,null,null,null,null,null,null,null,null,42,4.75,619.07299999999998,null,null,null,null,null,null,null,null,null,null,null,null,null,null,null,null,null,null,null,1.625]
[1.75,731,1.75,741.48500000000001,null,43,5.25,732,null,null,null,null,null,null,null,null,null,43,4.875,610.65499999999997,null,null,null,null,null,null,null,null,null,null,null,null,null,null,null,null,null,null,null,1.75]
[1.875,731,1.875,746.39599999999996,null,44,5.375,731,null,null,null,null,null,null,null,null,null,44,5,602.23699999999997,null,null,null,null,null,null,null,null,null,null,null,null,null,null,null,null,null,null,null,1.875]
[2,732,2,746.39599999999996,null,45,5.5,731,null,null,null,null,null,null,null,null,null,45,5.125,589.61,null,null,null,null,null,null,null,null,null,null,null,null,null,null,null,null,null,null,null,2]
[2.125,731,2.125,752.00800000000004,null,46,5.625,731,null,null,null,null,null,null,null,null,null,46,5.25,581.89400000000001,null,null,null,null,null,null,null,null,null,null,null,null,null,null,null,null,null,null,null,2.125]
[2.25,731,2.25,752.00800000000004,null,47,5.75,731,null,null,null,null,null,null,null,null,null,47,5.375,573.827,null,null,null,null,null,null,null,null,null,null,null,null,null,null,null,null,null,null,null,2.25]
[2.375,731,2.375,756.91800000000001,null,48,5.875,731,null,null,null,null,null,null,null,null,null,48,5.5,565.75900000000001,null,null,null,null,null,null,null,null,null,null,null,null,null,null,null,null,null,null,null,2.375]
[2.5,731,2.5,756.91800000000001,null,49,6,731,null,null,null,null,null,null,null,null,null,49,5.625,553.83399999999995,null,null,null,null,null,null,null,null,null,null,null,null,null,null,null,null,null,null,null,2.5]
[2.625,731,2.625,756.91800000000001,null,50,6.125,731,null,null,null,null,null,null,null,null,null,50,5.75,542.61,null,null,null,null,null,null,null,null,null,null,null,null,null,null,null,null,null,null,null,2.625]
[2.75,732,2.75,752.00800000000004,null,51,6.25,731,null,null,null,null,null,null,null,null,null,51,5.875,535.24400000000003,null,null,null,null,null,null,null,null,null,null,null,null,null,null,null,null,null,null,null,2.75]
[2.875,731,2.875,752.00800000000004,null,52,6.375,731,null,null,null,null,null,null,null,null,null,52,6,524.02,null,null,null,null,null,null,null,null,null,null,null,null,null,null,null,null,null,null,null,2.875]
[3,731,3,746.39599999999996,null,53,6.5,731,null,null,null,null,null,null,null,null,null,53,6.125,513.14700000000005,null,null,null,null,null,null,null,null,null,null,null,null,null,null,null,null,null,null,null,3]
[3.125,731,3.125,746.39599999999996,null,54,6.625,731,null,null,null,null,null,null,null,null,null,54,6.25,499.11700000000002,null,null,null,null,null,null,null,null,null,null,null,null,null,null,null,null,null,null,null,3.125]
[3.25,731,3.25,736.57500000000005,null,55,6.75,731,null,null,null,null,null,null,null,null,null,55,6.375,489.29599999999999,null,null,null,null,null,null,null,null,null,null,null,null,null,null,null,null,null,null,null,3.25]
[3.375,731,3.375,726.05200000000002,null,56,6.875,731,null,null,null,null,null,null,null,null,null,56,6.5,479.12400000000002,null,null,null,null,null,null,null,null,null,null,null,null,null,null,null,null,null,null,null,3.375]
[3.5,731,3.5,721.14200000000005,null,57,7,732,null,null,null,null,null,null,null,null,null,57,6.625,466.14600000000002,null,null,null,null,null,null,null,null,null,null,null,null,null,null,null,null,null,null,null,3.5]
[3.625,732,3.625,716.23099999999999,null,58,7.125,731,null,null,null,null,null,null,null,null,null,58,6.75,459.13099999999997,null,null,null,null,null,null,null,null,null,null,null,null,null,null,null,null,null,null,null,3.625]
[3.75,731,3.75,701.5,null,59,7.25,731,null,null,null,null,null,null,null,null,null,59,6.875,449.661,null,null,null,null,null,null,null,null,null,null,null,null,null,null,null,null,null,null,null,3.75]
[3.875,732,3.875,691.67899999999997,null,60,7.375,731,null,null,null,null,null,null,null,null,null,60,7,443.69799999999998,null,null,null,null,null,null,null,null,null,null,null,null,null,null,null,null,null,null,null,3.875]
[4,731,4,681.85799999999995,null,61,7.5,731,null,null,null,null,null,null,null,null,null,61,7.125,437.73599999999999,null,null,null,null,null,null,null,null,null,null,null,null,null,null,null,null,null,null,null,4]
[4.125,731,4.125,672.73800000000006,null,62,7.625,731,null,null,null,null,null,null,null,null,null,62,7.25,434.57900000000001,null,null,null,null,null,null,null,null,null,null,null,null,null,null,null,null,null,null,null,4.125]
[4.25,731,4.25,663.61900000000003,null,63,7.75,731,null,null,null,null,null,null,null,null,null,63,7.375,434.57900000000001,null,null,null,null,null,null,null,null,null,null,null,null,null,null,null,null,null,null,null,4.25]
[4.375,731,4.375,649.58900000000006,null,64,7.875,731,null,null,null,null,null,null,null,null,null,64,7.5,434.57900000000001,null,null,null,null,null,null,null,null,null,null,null,null,null,null,null,null,null,null,null,4.375]
[4.5,731,4.5,641.17100000000005,null,65,8,731,null,null,null,null,null,null,null,null,null,65,7.625,437.73599999999999,null,null,null,null,null,null,null,null,null,null,null,null,null,null,null,null,null,null,null,4.5]
[4.625,731,4.625,627.49099999999999,null,66,{"$f":"INDEX($A$200:$A$1200,MATCH(\"t in*\",$A$200:$A$1200,0)+F326)","v":8.125},{"$f":"INDEX($B$200:$B$1200,MATCH(\"t in*\",$A$200:$A$1200,0)+F326)","v":731},null,null,null,null,null,null,null,null,null,66,{"$f":"INDEX($C$1:$C$500,MATCH(\"t in*\",$C$1:$C$500,0)+R323)","v":7.75},437.73599999999999,null,null,null,null,null,null,null,null,null,null,null,null,null,null,null,null,null,null,null,4.625]
[4.75,731,4.75,619.07299999999998,null,67,8.25,731,null,null,null,null,null,null,null,null,null,{"$f":"R326+1","v":67},7.875,{"$f":"INDEX($D$1:$D$500,MATCH(\"t in*\",$C$1:$C$500,0)+R324)","v":443.69799999999998},null,null,null,null,null,null,null,null,null,null,null,null,null,null,null,null,null,null,null,4.75]
[4.875,731,4.875,610.65499999999997,null,68,8.375,732,null,null,null,null,null,null,null,null,null,68,8,449.661,null,null,null,null,null,null,null,null,null,null,null,null,null,null,null,null,null,null,null,4.875]
[5,730,5,602.23699999999997,null,69,8.5,731,null,null,null,null,null,null,null,null,null,69,8.125,456.32499999999999,null,null,null,null,null,null,null,null,null,null,null,null,null,null,null,null,null,null,null,5]
[5.125,731,5.125,589.61,null,70,8.625,731,null,null,null,null,null,null,null,null,null,70,8.25,459.13099999999997,null,null,null,null,null,null,null,null,null,null,null,null,null,null,null,null,null,null,null,5.125]
[5.25,732,5.25,581.89400000000001,null,71,8.75,731,null,null,null,null,null,null,null,null,null,71,8.375,469.303,null,null,null,null,null,null,null,null,null,null,null,null,null,null,null,null,null,null,null,5.25]
[5.375,731,5.375,573.827,null,72,8.875,732,null,null,null,null,null,null,null,null,null,72,8.5,475.61700000000002,null,null,null,null,null,null,null,null,null,null,null,null,null,null,null,null,null,null,null,5.375]
[5.5,731,5.5,565.75900000000001,null,73,9,731,null,null,null,null,null,null,null,null,null,73,8.625,486.13900000000001,null,null,null,null,null,null,null,null,null,null,null,null,null,null,null,null,null,null,null,5.5]
[5.625,731,5.625,553.83399999999995,null,74,9.125,732,null,null,null,null,null,null,null,null,null,74,8.75,492.45299999999997,null,null,null,null,null,null,null,null,null,null,null,null,null,null,null,null,null,null,null,5.625]
[5.75,731,5.75,542.61,null,75,9.25,731,null,null,null,null,null,null,null,null,null,75,8.875,502.62400000000002,null,null,null,null,null,null,null,null,null,null,null,null,null,null,null,null,null,null,null,5.75]
[5.875,731,5.875,535.24400000000003,null,76,9.375,731,null,null,null,null,null,null,null,null,null,76,9,516.654,null,null,null,null,null,null,null,null,null,null,null,null,null,null,null,null,null,null,null,5.875]
[6,731,6,524.02,null,77,9.5,731,null,null,null,null,null,null,null,null,null,77,9.125,524.02,null,null,null,null,null,null,null,null,null,null,null,null,null,null,null,null,null,null,null,6]
[6.125,731,6.125,513.14700000000005,null,78,9.625,731,null,null,null,null,null,null,null,null,null,78,9.25,535.24400000000003,null,null,null,null,null,null,null,null,null,null,null,null,null,null,null,null,null,null,null,6.125]
[6.25,731,6.25,499.11700000000002,null,79,9.75,731,null,null,null,null,null,null,null,null,null,79,9.375,550.32600000000002,null,null,null,null,null,null,null,null,null,null,null,null,null,null,null,null,null,null,null,6.25]
[6.375,731,6.375,489.29599999999999,null,80,9.875,731,null,null,null,null,null,null,null,null,null,80,9.5,558.04300000000001,null,null,null,null,null,null,null,null,null,null,null,null,null,null,null,null,null,null,null,6.375]
[6.5,731,6.5,479.12400000000002,null,81,10,731,null,null,null,null,null,null,null,null,null,81,9.625,569.96799999999996,null,null,null,null,null,null,null,null,null,null,null,null,null,null,null,null,null,null,null,6.5]
[6.625,731,6.625,466.14600000000002,null,82,10.125,731,null,null,null,null,null,null,null,null,null,82,9.75,581.89400000000001,null,null,null,null,null,null,null,null,null,null,null,null,null,null,null,null,null,null,null,6.625]
[6.75,731,6.75,459.13099999999997,null,83,10.25,731,null,null,null,null,null,null,null,null,null,83,9.875,593.81899999999996,null,null,null,null,null,null,null,null,null,null,null,null,null,null,null,null,null,null,null,6.75]
[6.875,731,6.875,449.661,null,84,10.375,731,null,null,null,null,null,null,null,null,null,84,10,602.23699999999997,null,null,null,null,null,null,null,null,null,null,null,null,null,null,null,null,null,null,null,6.875]
[7,732,7,443.69799999999998,null,85,10.5,731,null,null,null,null,null,null,null,null,null,85,10.125,614.86400000000003,null,null,null,null,null,null,null,null,null,null,null,null,null,null,null,null,null,null,null,7]
[7.125,731,7.125,437.73599999999999,null,{"$f":"F345+1","v":86},10.625,731,null,null,null,null,null,null,null,null,null,86,10.25,627.49099999999999,null,null,null,null,null,null,null,null,null,null,null,null,null,null,null,null,null,null,null,7.125]
[7.25,731,7.25,434.57900000000001,null,87,10.75,730,null,null,null,null,null,null,null,null,null,87,10.375,636.26,null,null,null,null,null,null,null,null,null,null,null,null,null,null,null,null,null,null,null,7.25]
[7.375,731,7.375,434.57900000000001,null,88,10.875,731,null,null,null,null,null,null,null,null,null,88,10.5,645.38,null,null,null,null,null,null,null,null,null,null,null,null,null,null,null,null,null,null,null,7.375]
[7.5,731,7.5,434.57900000000001,null,89,11,731,null,null,null,null,null,null,null,null,null,89,10.625,659.05899999999997,null,null,null,null,null,null,null,null,null,null,null,null,null,null,null,null,null,null,null,7.5]
[7.625,731,7.625,437.73599999999999,null,90,11.125,731,null,null,null,null,null,null,null,null,null,90,10.75,668.178,null,null,null,null,null,null,null,null,null,null,null,null,null,null,null,null,null,null,null,7.625]
[7.75,731,7.75,437.73599999999999,null,91,11.25,731,null,null,null,null,null,null,null,null,null,91,10.875,677.298,null,null,null,null,null,null,null,null,null,null,null,null,null,null,null,null,null,null,null,7.75]
[7.875,731,7.875,443.69799999999998,null,92,11.375,731,null,null,null,null,null,null,null,null,null,92,11,681.85799999999995,null,null,null,null,null,null,null,null,null,null,null,null,null,null,null,null,null,null,null,7.875]
[8,731,8,449.661,null,93,11.5,731,null,null,null,null,null,null,null,null,null,93,11.125,691.67899999999997,null,null,null,null,null,null,null,null,null,null,null,null,null,null,null,null,null,null,null,8]
[8.125,731,8.125,456.32499999999999,null,94,11.625,731,null,null,null,null,null,null,null,null,null,94,11.25,701.5,null,null,null,null,null,null,null,null,null,null,null,null,null,null,null,null,null,null,null,8.125]
[8.25,731,8.25,459.13099999999997,null,95,11.75,731,null,null,null,null,null,null,null,null,null,95,11.375,711.32100000000003,null,null,null,null,null,null,null,null,null,null,null,null,null,null,null,null,null,null,null,8.25]
[8.375,732,8.375,469.303,null,96,11.875,731,null,null,null,null,null,null,null,null,null,96,11.5,711.32100000000003,null,null,null,null,null,null,null,null,null,null,null,null,null,null,null,null,null,null,null,8.375]
[8.5,731,8.5,475.61700000000002,null,97,12,731,null,null,null,null,null,null,null,null,null,97,11.625,721.14200000000005,null,null,null,null,null,null,null,null,null,null,null,null,null,null,null,null,null,null,null,8.5]
[8.625,731,8.625,486.13900000000001,null,98,12.125,732,null,null,null,null,null,null,null,null,null,98,11.75,730.96299999999997,null,null,null,null,null,null,null,null,null,null,null,null,null,null,null,null,null,null,null,8.625]
[8.75,731,8.75,492.45299999999997,null,99,12.25,731,null,null,null,null,null,null,null,null,null,99,11.875,736.57500000000005,null,null,null,null,null,null,null,null,null,null,null,null,null,null,null,null,null,null,null,8.75]
[8.875,732,8.875,502.62400000000002,null,100,12.375,731,null,null,null,null,null,null,null,null,null,100,12,741.48500000000001,null,null,null,null,null,null,null,null,null,null,null,null,null,null,null,null,null,null,null,8.875]
[9,731,9,516.654,null,101,12.5,731,null,null,null,null,null,null,null,null,null,101,12.125,746.39599999999996,null,null,null,null,null,null,null,null,null,null,null,null,null,null,null,null,null,null,null,9]
[9.125,732,9.125,524.02,null,102,12.625,731,null,null,null,null,null,null,null,null,null,102,12.25,746.39599999999996,null,null,null,null,null,null,null,null,null,null,null,null,null,null,null,null,null,null,null,9.125]
[9.25,731,9.25,535.24400000000003,null,103,12.75,731,null,null,null,null,null,null,null,null,null,103,12.375,752.00800000000004,null,null,null,null,null,null,null,null,null,null,null,null,null,null,null,null,null,null,null,9.25]
[9.375,731,9.375,550.32600000000002,null,104,12.875,731,null,null,null,null,null,null,null,null,null,104,12.5,752.00800000000004,null,null,null,null,null,null,null,null,null,null,null,null,null,null,null,null,null,null,null,9.375]
[9.5,731,9.5,558.04300000000001,null,105,13,731,null,null,null,null,null,null,null,null,null,105,12.625,752.00800000000004,null,null,null,null,null,null,null,null,null,null,null,null,null,null,null,null,null,null,null,9.5]
[9.625,731,9.625,569.96799999999996,null,106,13.125,731,null,null,null,null,null,null,null,null,null,106,12.75,752.00800000000004,null,null,null,null,null,null,null,null,null,null,null,null,null,null,null,null,null,null,null,9.625]
[9.75,731,9.75,581.89400000000001,null,107,13.25,730,null,null,null,null,null,null,null,null,null,107,12.875,746.39599999999996,null,null,null,null,null,null,null,null,null,null,null,null,null,null,null,null,null,null,null,9.75]
[9.875,731,9.875,593.81899999999996,null,108,13.375,731,null,null,null,null,null,null,null,null,null,108,13,741.48500000000001,null,null,null,null,null,null,null,null,null,null,null,null,null,null,null,null,null,null,null,9.875]
[10,731,10,602.23699999999997,null,109,13.5,731,null,null,null,null,null,null,null,null,null,109,13.125,736.57500000000005,null,null,null,null,null,null,null,null,null,null,null,null,null,null,null,null,null,null,null,10]
[10.125,731,10.125,614.86400000000003,null,110,13.625,731,null,null,null,null,null,null,null,null,null,110,13.25,730.96299999999997,null,null,null,null,null,null,null,null,null,null,null,null,null,null,null,null,null,null,null,10.125]
[10.25,731,10.25,627.49099999999999,null,111,13.75,730,null,null,null,null,null,null,null,null,null,111,13.375,721.14200000000005,null,null,null,null,null,null,null,null,null,null,null,null,null,null,null,null,null,null,null,10.25]
[10.375,731,10.375,636.26,null,112,13.875,731,null,null,null,null,null,null,null,null,null,112,13.5,716.23099999999999,null,null,null,null,null,null,null,null,null,null,null,null,null,null,null,null,null,null,null,10.375]
[10.5,731,10.5,645.38,null,113,14,731,null,null,null,null,null,null,null,null,null,113,13.625,706.41,null,null,null,null,null,null,null,null,null,null,null,null,null,null,null,null,null,null,null,10.5]
[10.625,731,10.625,659.05899999999997,null,114,14.125,731,null,null,null,null,null,null,null,null,null,114,13.75,701.5,null,null,null,null,null,null,null,null,null,null,null,null,null,null,null,null,null,null,null,10.625]
[10.75,730,10.75,668.178,null,115,14.25,731,null,null,null,null,null,null,null,null,null,115,13.875,687.11900000000003,null,null,null,null,null,null,null,null,null,null,null,null,null,null,null,null,null,null,null,10.75]
[10.875,731,10.875,677.298,null,116,14.375,731,null,null,null,null,null,null,null,null,null,116,14,677.298,null,null,null,null,null,null,null,null,null,null,null,null,null,null,null,null,null,null,null,10.875]
[11,731,11,681.85799999999995,null,117,14.5,731,null,null,null,null,null,null,null,null,null,117,14.125,668.178,null,null,null,null,null,null,null,null,null,null,null,null,null,null,null,null,null,null,null,11]
[11.125,731,11.125,691.67899999999997,null,118,14.625,732,null,null,null,null,null,null,null,null,null,118,14.25,659.05899999999997,null,null,null,null,null,null,null,null,null,null,null,null,null,null,null,null,null,null,null,11.125]
[11.25,731,11.25,701.5,null,119,14.75,731,null,null,null,null,null,null,null,null,null,119,14.375,645.38,null,null,null,null,null,null,null,null,null,null,null,null,null,null,null,null,null,null,null,11.25]
[11.375,731,11.375,711.32100000000003,null,120,14.875,731,null,null,null,null,null,null,null,null,null,120,14.5,636.26,null,null,null,null,null,null,null,null,null,null,null,null,null,null,null,null,null,null,null,11.375]
[11.5,731,11.5,711.32100000000003,null,121,15,731,null,null,null,null,null,null,null,null,null,121,14.625,623.28200000000004,null,null,null,null,null,null,null,null,null,null,null,null,null,null,null,null,null,null,null,11.5]
[11.625,731,11.625,721.14200000000005,null,122,15.125,731,null,null,null,null,null,null,null,null,null,122,14.75,619.07299999999998,null,null,null,null,null,null,null,null,null,null,null,null,null,null,null,null,null,null,null,11.625]
[11.75,731,11.75,730.96299999999997,null,123,15.25,731,null,null,null,null,null,null,null,null,null,123,14.875,606.44600000000003,null,null,null,null,null,null,null,null,null,null,null,null,null,null,null,null,null,null,null,11.75]
[11.875,731,11.875,736.57500000000005,null,124,15.375,731,null,null,null,null,null,null,null,null,null,124,15,598.37900000000002,null,null,null,null,null,null,null,null,null,null,null,null,null,null,null,null,null,null,null,11.875]
[12,731,12,741.48500000000001,null,125,15.5,731,null,null,null,null,null,null,null,null,null,125,15.125,589.61,null,null,null,null,null,null,null,null,null,null,null,null,null,null,null,null,null,null,null,12]
[12.125,732,12.125,746.39599999999996,null,126,15.625,731,null,null,null,null,null,null,null,null,null,126,15.25,585.75199999999995,null,null,null,null,null,null,null,null,null,null,null,null,null,null,null,null,null,null,null,12.125]
[12.25,731,12.25,746.39599999999996,null,127,15.75,731,null,null,null,null,null,null,null,null,null,127,15.375,573.827,null,null,null,null,null,null,null,null,null,null,null,null,null,null,null,null,null,null,null,12.25]
[12.375,731,12.375,752.00800000000004,null,128,15.875,731,null,null,null,null,null,null,null,null,null,128,15.5,565.75900000000001,null,null,null,null,null,null,null,null,null,null,null,null,null,null,null,null,null,null,null,12.375]
[12.5,731,12.5,752.00800000000004,null,129,16,731,null,null,null,null,null,null,null,null,null,129,15.625,558.04300000000001,null,null,null,null,null,null,null,null,null,null,null,null,null,null,null,null,null,null,null,12.5]
[12.625,731,12.625,752.00800000000004,null,130,{"$f":"INDEX($A$200:$A$1200,MATCH(\"t in*\",$A$200:$A$1200,0)+F390)","v":16.125},{"$f":"INDEX($B$200:$B$1200,MATCH(\"t in*\",$A$200:$A$1200,0)+F390)","v":731},null,null,null,null,null,null,null,null,null,130,{"$f":"INDEX($C$1:$C$500,MATCH(\"t in*\",$C$1:$C$500,0)+R387)","v":15.75},550.32600000000002,null,null,null,null,null,null,null,null,null,null,null,null,null,null,null,null,null,null,null,12.625]
[12.75,731,12.75,752.00800000000004,null,131,16.25,731,null,null,null,null,null,null,null,null,null,{"$f":"R390+1","v":131},15.875,{"$f":"INDEX($D$1:$D$500,MATCH(\"t in*\",$C$1:$C$500,0)+R388)","v":535.24400000000003},null,null,null,null,null,null,null,null,null,null,null,null,null,null,null,null,null,null,null,12.75]
[12.875,731,12.875,746.39599999999996,null,132,16.375,731,null,null,null,null,null,null,null,null,null,132,16,527.52800000000002,null,null,null,null,null,null,null,null,null,null,null,null,null,null,null,null,null,null,null,12.875]
[13,731,13,741.48500000000001,null,133,16.5,731,null,null,null,null,null,null,null,null,null,133,16.125,513.14700000000005,null,null,null,null,null,null,null,null,null,null,null,null,null,null,null,null,null,null,null,13]
[13.125,731,13.125,736.57500000000005,null,134,16.625,730,null,null,null,null,null,null,null,null,null,134,16.25,502.62400000000002,null,null,null,null,null,null,null,null,null,null,null,null,null,null,null,null,null,null,null,13.125]
[13.25,730,13.25,730.96299999999997,null,135,16.75,731,null,null,null,null,null,null,null,null,null,135,16.375,492.45299999999997,null,null,null,null,null,null,null,null,null,null,null,null,null,null,null,null,null,null,null,13.25]
[13.375,731,13.375,721.14200000000005,null,136,16.875,731,null,null,null,null,null,null,null,null,null,136,16.5,482.28100000000001,null,null,null,null,null,null,null,null,null,null,null,null,null,null,null,null,null,null,null,13.375]
[13.5,731,13.5,716.23099999999999,null,137,17,732,null,null,null,null,null,null,null,null,null,137,16.625,472.46,null,null,null,null,null,null,null,null,null,null,null,null,null,null,null,null,null,null,null,13.5]
[13.625,731,13.625,706.41,null,138,17.125,731,null,null,null,null,null,null,null,null,null,138,16.75,459.13099999999997,null,null,null,null,null,null,null,null,null,null,null,null,null,null,null,null,null,null,null,13.625]
[13.75,730,13.75,701.5,null,139,17.25,731,null,null,null,null,null,null,null,null,null,139,16.875,453.16899999999998,null,null,null,null,null,null,null,null,null,null,null,null,null,null,null,null,null,null,null,13.75]
[13.875,731,13.875,687.11900000000003,null,140,17.375,731,null,null,null,null,null,null,null,null,null,140,17,446.85500000000002,null,null,null,null,null,null,null,null,null,null,null,null,null,null,null,null,null,null,null,13.875]
[14,731,14,677.298,null,141,17.5,731,null,null,null,null,null,null,null,null,null,141,17.125,440.54199999999997,null,null,null,null,null,null,null,null,null,null,null,null,null,null,null,null,null,null,null,14]
[14.125,731,14.125,668.178,null,142,17.625,731,null,null,null,null,null,null,null,null,null,142,17.25,437.73599999999999,null,null,null,null,null,null,null,null,null,null,null,null,null,null,null,null,null,null,null,14.125]
[14.25,731,14.25,659.05899999999997,null,143,17.75,731,null,null,null,null,null,null,null,null,null,143,17.375,437.73599999999999,null,null,null,null,null,null,null,null,null,null,null,null,null,null,null,null,null,null,null,14.25]
[14.375,731,14.375,645.38,null,144,17.875,731,null,null,null,null,null,null,null,null,null,144,17.5,437.73599999999999,null,null,null,null,null,null,null,null,null,null,null,null,null,null,null,null,null,null,null,14.375]
[14.5,731,14.5,636.26,null,145,18,731,null,null,null,null,null,null,null,null,null,145,17.625,437.73599999999999,null,null,null,null,null,null,null,null,null,null,null,null,null,null,null,null,null,null,null,14.5]
[14.625,732,14.625,623.28200000000004,null,146,18.125,731,null,null,null,null,null,null,null,null,null,146,17.75,440.54199999999997,null,null,null,null,null,null,null,null,null,null,null,null,null,null,null,null,null,null,null,14.625]
[14.75,731,14.75,619.07299999999998,null,147,18.25,731,null,null,null,null,null,null,null,null,null,147,17.875,446.85500000000002,null,null,null,null,null,null,null,null,null,null,null,null,null,null,null,null,null,null,null,14.75]
[14.875,731,14.875,606.44600000000003,null,148,18.375,731,null,null,null,null,null,null,null,null,null,148,18,453.16899999999998,null,null,null,null,null,null,null,null,null,null,null,null,null,null,null,null,null,null,null,14.875]
[15,731,15,598.37900000000002,null,149,18.5,731,null,null,null,null,null,null,null,null,null,149,18.125,456.32499999999999,null,null,null,null,null,null,null,null,null,null,null,null,null,null,null,null,null,null,null,15]
[15.125,731,15.125,589.61,null,{"$f":"F409+1","v":150},18.625,731,null,null,null,null,null,null,null,null,null,150,18.25,462.99,null,null,null,null,null,null,null,null,null,null,null,null,null,null,null,null,null,null,null,15.125]
[15.25,731,15.25,585.75199999999995,null,151,18.75,731,null,null,null,null,null,null,null,null,null,151,18.375,472.46,null,null,null,null,null,null,null,null,null,null,null,null,null,null,null,null,null,null,null,15.25]
[15.375,731,15.375,573.827,null,152,18.875,730,null,null,null,null,null,null,null,null,null,152,18.5,482.28100000000001,null,null,null,null,null,null,null,null,null,null,null,null,null,null,null,null,null,null,null,15.375]
[15.5,731,15.5,565.75900000000001,null,153,19,730,null,null,null,null,null,null,null,null,null,153,18.625,489.29599999999999,null,null,null,null,null,null,null,null,null,null,null,null,null,null,null,null,null,null,null,15.5]
[15.625,731,15.625,558.04300000000001,null,154,19.125,731,null,null,null,null,null,null,null,null,null,154,18.75,495.96,null,null,null,null,null,null,null,null,null,null,null,null,null,null,null,null,null,null,null,15.625]
[15.75,731,15.75,550.32600000000002,null,155,19.25,731,null,null,null,null,null,null,null,null,null,155,18.875,509.63900000000001,null,null,null,null,null,null,null,null,null,null,null,null,null,null,null,null,null,null,null,15.75]
[15.875,731,15.875,535.24400000000003,null,156,19.375,731,null,null,null,null,null,null,null,null,null,156,19,520.51300000000003,null,null,null,null,null,null,null,null,null,null,null,null,null,null,null,null,null,null,null,15.875]
[16,731,16,527.52800000000002,null,157,19.5,731,null,null,null,null,null,null,null,null,null,157,19.125,531.73699999999997,null,null,null,null,null,null,null,null,null,null,null,null,null,null,null,null,null,null,null,16]
[16.125,731,16.125,513.14700000000005,null,158,19.625,731,null,null,null,null,null,null,null,null,null,158,19.25,542.61,null,null,null,null,null,null,null,null,null,null,null,null,null,null,null,null,null,null,null,16.125]
[16.25,731,16.25,502.62400000000002,null,159,19.75,731,null,null,null,null,null,null,null,null,null,159,19.375,553.83399999999995,null,null,null,null,null,null,null,null,null,null,null,null,null,null,null,null,null,null,null,16.25]
[16.375,731,16.375,492.45299999999997,null,160,19.875,731,null,null,null,null,null,null,null,null,null,160,19.5,565.75900000000001,null,null,null,null,null,null,null,null,null,null,null,null,null,null,null,null,null,null,null,16.375]
[16.5,731,16.5,482.28100000000001,null,161,20,731,null,null,null,null,null,null,null,null,null,161,19.625,577.68499999999995,null,null,null,null,null,null,null,null,null,null,null,null,null,null,null,null,null,null,null,16.5]
[16.625,730,16.625,472.46,null,162,20.125,731,null,null,null,null,null,null,null,null,null,162,19.75,589.61,null,null,null,null,null,null,null,null,null,null,null,null,null,null,null,null,null,null,null,16.625]
[16.75,731,16.75,459.13099999999997,null,163,20.25,731,null,null,null,null,null,null,null,null,null,163,19.875,602.23699999999997,null,null,null,null,null,null,null,null,null,null,null,null,null,null,null,null,null,null,null,16.75]
[16.875,731,16.875,453.16899999999998,null,164,20.375,731,null,null,null,null,null,null,null,null,null,164,20,614.86400000000003,null,null,null,null,null,null,null,null,null,null,null,null,null,null,null,null,null,null,null,16.875]
[17,732,17,446.85500000000002,null,165,20.5,731,null,null,null,null,null,null,null,null,null,165,20.125,623.28200000000004,null,null,null,null,null,null,null,null,null,null,null,null,null,null,null,null,null,null,null,17]
[17.125,731,17.125,440.54199999999997,null,166,20.625,731,null,null,null,null,null,null,null,null,null,166,20.25,636.26,null,null,null,null,null,null,null,null,null,null,null,null,null,null,null,null,null,null,null,17.125]
[17.25,731,17.25,437.73599999999999,null,167,20.75,731,null,null,null,null,null,null,null,null,null,167,20.375,645.38,null,null,null,null,null,null,null,null,null,null,null,null,null,null,null,null,null,null,null,17.25]
[17.375,731,17.375,437.73599999999999,null,168,20.875,731,null,null,null,null,null,null,null,null,null,168,20.5,654.49900000000002,null,null,null,null,null,null,null,null,null,null,null,null,null,null,null,null,null,null,null,17.375]
[17.5,731,17.5,437.73599999999999,null,169,21,731,null,null,null,null,null,null,null,null,null,169,20.625,663.61900000000003,null,null,null,null,null,null,null,null,null,null,null,null,null,null,null,null,null,null,null,17.5]
[17.625,731,17.625,437.73599999999999,null,170,21.125,731,null,null,null,null,null,null,null,null,null,170,20.75,677.298,null,null,null,null,null,null,null,null,null,null,null,null,null,null,null,null,null,null,null,17.625]
[17.75,731,17.75,440.54199999999997,null,171,21.25,731,null,null,null,null,null,null,null,null,null,171,20.875,681.85799999999995,null,null,null,null,null,null,null,null,null,null,null,null,null,null,null,null,null,null,null,17.75]
[17.875,731,17.875,446.85500000000002,null,172,21.375,730,null,null,null,null,null,null,null,null,null,172,21,691.67899999999997,null,null,null,null,null,null,null,null,null,null,null,null,null,null,null,null,null,null,null,17.875]
[18,731,18,453.16899999999998,null,173,21.5,731,null,null,null,null,null,null,null,null,null,173,21.125,701.5,null,null,null,null,null,null,null,null,null,null,null,null,null,null,null,null,null,null,null,18]
[18.125,731,18.125,456.32499999999999,null,174,21.625,730,null,null,null,null,null,null,null,null,null,174,21.25,711.32100000000003,null,null,null,null,null,null,null,null,null,null,null,null,null,null,null,null,null,null,null,18.125]
[18.25,731,18.25,462.99,null,175,21.75,731,null,null,null,null,null,null,null,null,null,175,21.375,716.23099999999999,null,null,null,null,null,null,null,null,null,null,null,null,null,null,null,null,null,null,null,18.25]
[18.375,731,18.375,472.46,null,176,21.875,730,null,null,null,null,null,null,null,null,null,176,21.5,721.14200000000005,null,null,null,null,null,null,null,null,null,null,null,null,null,null,null,null,null,null,null,18.375]
[18.5,731,18.5,482.28100000000001,null,177,22,731,null,null,null,null,null,null,null,null,null,177,21.625,730.96299999999997,null,null,null,null,null,null,null,null,null,null,null,null,null,null,null,null,null,null,null,18.5]
[18.625,731,18.625,489.29599999999999,null,178,22.125,730,null,null,null,null,null,null,null,null,null,178,21.75,736.57500000000005,null,null,null,null,null,null,null,null,null,null,null,null,null,null,null,null,null,null,null,18.625]
[18.75,731,18.75,495.96,null,179,22.25,731,null,null,null,null,null,null,null,null,null,179,21.875,741.48500000000001,null,null,null,null,null,null,null,null,null,null,null,null,null,null,null,null,null,null,null,18.75]
[18.875,730,18.875,509.63900000000001,null,180,22.375,731,null,null,null,null,null,null,null,null,null,180,22,746.39599999999996,null,null,null,null,null,null,null,null,null,null,null,null,null,null,null,null,null,null,null,18.875]
[19,730,19,520.51300000000003,null,181,22.5,731,null,null,null,null,null,null,null,null,null,181,22.125,752.00800000000004,null,null,null,null,null,null,null,null,null,null,null,null,null,null,null,null,null,null,null,19]
[19.125,731,19.125,531.73699999999997,null,182,22.625,731,null,null,null,null,null,null,null,null,null,182,22.25,756.91800000000001,null,null,null,null,null,null,null,null,null,null,null,null,null,null,null,null,null,null,null,19.125]
[19.25,731,19.25,542.61,null,183,22.75,731,null,null,null,null,null,null,null,null,null,183,22.375,756.91800000000001,null,null,null,null,null,null,null,null,null,null,null,null,null,null,null,null,null,null,null,19.25]
[19.375,731,19.375,553.83399999999995,null,184,22.875,731,null,null,null,null,null,null,null,null,null,184,22.5,756.91800000000001,null,null,null,null,null,null,null,null,null,null,null,null,null,null,null,null,null,null,null,19.375]
[19.5,731,19.5,565.75900000000001,null,185,23,731,null,null,null,null,null,null,null,null,null,185,22.625,756.91800000000001,null,null,null,null,null,null,null,null,null,null,null,null,null,null,null,null,null,null,null,19.5]
[19.625,731,19.625,577.68499999999995,null,186,23.125,731,null,null,null,null,null,null,null,null,null,186,22.75,756.91800000000001,null,null,null,null,null,null,null,null,null,null,null,null,null,null,null,null,null,null,null,19.625]
[19.75,731,19.75,589.61,null,187,23.25,731,null,null,null,null,null,null,null,null,null,187,22.875,752.00800000000004,null,null,null,null,null,null,null,null,null,null,null,null,null,null,null,null,null,null,null,19.75]
[19.875,731,19.875,602.23699999999997,null,188,23.375,731,null,null,null,null,null,null,null,null,null,188,23,746.39599999999996,null,null,null,null,null,null,null,null,null,null,null,null,null,null,null,null,null,null,null,19.875]
[20,731,20,614.86400000000003,null,189,23.5,731,null,null,null,null,null,null,null,null,null,189,23.125,741.48500000000001,null,null,null,null,null,null,null,null,null,null,null,null,null,null,null,null,null,null,null,20]
[20.125,731,20.125,623.28200000000004,null,190,23.625,731,null,null,null,null,null,null,null,null,null,190,23.25,741.48500000000001,null,null,null,null,null,null,null,null,null,null,null,null,null,null,null,null,null,null,null,20.125]
[20.25,731,20.25,636.26,null,191,23.75,731,null,null,null,null,null,null,null,null,null,191,23.375,730.96299999999997,null,null,null,null,null,null,null,null,null,null,null,null,null,null,null,null,null,null,null,20.25]
[20.375,731,20.375,645.38,null,192,23.875,731,null,null,null,null,null,null,null,null,null,192,23.5,721.14200000000005,null,null,null,null,null,null,null,null,null,null,null,null,null,null,null,null,null,null,null,20.375]
[20.5,731,20.5,654.49900000000002,null,193,24,731,null,null,null,null,null,null,null,null,null,193,23.625,711.32100000000003,null,null,null,null,null,null,null,null,null,null,null,null,null,null,null,null,null,null,null,20.5]
[20.625,731,20.625,663.61900000000003,null,194,{"$f":"INDEX($A$200:$A$1200,MATCH(\"t in*\",$A$200:$A$1200,0)+F454)","v":24.125},{"$f":"INDEX($B$200:$B$1200,MATCH(\"t in*\",$A$200:$A$1200,0)+F454)","v":731},null,null,null,null,null,null,null,null,null,194,{"$f":"INDEX($C$1:$C$500,MATCH(\"t in*\",$C$1:$C$500,0)+R451)","v":23.75},706.41,null,null,null,null,null,null,null,null,null,null,null,null,null,null,null,null,null,null,null,20.625]
[20.75,731,20.75,677.298,null,195,24.25,731,null,null,null,null,null,null,null,null,null,{"$f":"R454+1","v":195},23.875,{"$f":"INDEX($D$1:$D$500,MATCH(\"t in*\",$C$1:$C$500,0)+R452)","v":691.67899999999997},null,null,null,null,null,null,null,null,null,null,null,null,null,null,null,null,null,null,null,20.75]
[20.875,731,20.875,681.85799999999995,null,196,24.375,731,null,null,null,null,null,null,null,null,null,196,24,681.85799999999995,null,null,null,null,null,null,null,null,null,null,null,null,null,null,null,null,null,null,null,20.875]
[21,731,21,691.67899999999997,null,197,24.5,731,null,null,null,null,null,null,null,null,null,197,24.125,677.298,null,null,null,null,null,null,null,null,null,null,null,null,null,null,null,null,null,null,null,21]
[21.125,731,21.125,701.5,null,198,24.625,731,null,null,null,null,null,null,null,null,null,198,24.25,663.61900000000003,null,null,null,null,null,null,null,null,null,null,null,null,null,null,null,null,null,null,null,21.125]
[21.25,731,21.25,711.32100000000003,null,199,24.75,731,null,null,null,null,null,null,null,null,null,199,24.375,649.58900000000006,null,null,null,null,null,null,null,null,null,null,null,null,null,null,null,null,null,null,null,21.25]
[21.375,730,21.375,716.23099999999999,null,200,24.875,731,null,null,null,null,null,null,null,null,null,200,24.5,641.17100000000005,null,null,null,null,null,null,null,null,null,null,null,null,null,null,null,null,null,null,null,21.375]
[21.5,731,21.5,721.14200000000005,null,201,25,731,null,null,null,null,null,null,null,null,null,201,24.625,631.70000000000005,null,null,null,null,null,null,null,null,null,null,null,null,null,null,null,null,null,null,null,21.5]
[21.625,730,21.625,730.96299999999997,null,202,25.125,731,null,null,null,null,null,null,null,null,null,202,24.75,619.07299999999998,null,null,null,null,null,null,null,null,null,null,null,null,null,null,null,null,null,null,null,21.625]
[21.75,731,21.75,736.57500000000005,null,203,25.25,731,null,null,null,null,null,null,null,null,null,203,24.875,610.65499999999997,null,null,null,null,null,null,null,null,null,null,null,null,null,null,null,null,null,null,null,21.75]
[21.875,730,21.875,741.48500000000001,null,204,25.375,731,null,null,null,null,null,null,null,null,null,204,25,602.23699999999997,null,null,null,null,null,null,null,null,null,null,null,null,null,null,null,null,null,null,null,21.875]
[22,731,22,746.39599999999996,null,205,25.5,731,null,null,null,null,null,null,null,null,null,205,25.125,593.81899999999996,null,null,null,null,null,null,null,null,null,null,null,null,null,null,null,null,null,null,null,22]
[22.125,730,22.125,752.00800000000004,null,206,25.625,731,null,null,null,null,null,null,null,null,null,206,25.25,585.75199999999995,null,null,null,null,null,null,null,null,null,null,null,null,null,null,null,null,null,null,null,22.125]
[22.25,731,22.25,756.91800000000001,null,207,25.75,731,null,null,null,null,null,null,null,null,null,207,25.375,573.827,null,null,null,null,null,null,null,null,null,null,null,null,null,null,null,null,null,null,null,22.25]
[22.375,731,22.375,756.91800000000001,null,208,25.875,731,null,null,null,null,null,null,null,null,null,208,25.5,565.75900000000001,null,null,null,null,null,null,null,null,null,null,null,null,null,null,null,null,null,null,null,22.375]
[22.5,731,22.5,756.91800000000001,null,209,26,731,null,null,null,null,null,null,null,null,null,209,25.625,558.04300000000001,null,null,null,null,null,null,null,null,null,null,null,null,null,null,null,null,null,null,null,22.5]
[22.625,731,22.625,756.91800000000001,null,210,26.125,730,null,null,null,null,null,null,null,null,null,210,25.75,546.46799999999996,null,null,null,null,null,null,null,null,null,null,null,null,null,null,null,null,null,null,null,22.625]
[22.75,731,22.75,756.91800000000001,null,211,26.25,731,null,null,null,null,null,null,null,null,null,211,25.875,539.10199999999998,null,null,null,null,null,null,null,null,null,null,null,null,null,null,null,null,null,null,null,22.75]
[22.875,731,22.875,752.00800000000004,null,212,26.375,730,null,null,null,null,null,null,null,null,null,212,26,524.02,null,null,null,null,null,null,null,null,null,null,null,null,null,null,null,null,null,null,null,22.875]
[23,731,23,746.39599999999996,null,213,26.5,731,null,null,null,null,null,null,null,null,null,213,26.125,516.654,null,null,null,null,null,null,null,null,null,null,null,null,null,null,null,null,null,null,null,23]
[23.125,731,23.125,741.48500000000001,null,{"$f":"F473+1","v":214},26.625,731,null,null,null,null,null,null,null,null,null,214,26.25,502.62400000000002,null,null,null,null,null,null,null,null,null,null,null,null,null,null,null,null,null,null,null,23.125]
[23.25,731,23.25,741.48500000000001,null,215,26.75,730,null,null,null,null,null,null,null,null,null,215,26.375,492.45299999999997,null,null,null,null,null,null,null,null,null,null,null,null,null,null,null,null,null,null,null,23.25]
[23.375,731,23.375,730.96299999999997,null,216,26.875,731,null,null,null,null,null,null,null,null,null,216,{"$error":"#REF!"},{"$error":"#REF!"},null,null,null,null,null,null,null,null,null,null,null,null,null,null,null,null,null,null,null,23.375]
[23.5,731,23.5,721.14200000000005,null,217,27,731,null,null,null,null,null,null,null,null,null,217,{"$error":"#REF!"},{"$error":"#REF!"},null,null,null,null,null,null,null,null,null,null,null,null,null,null,null,null,null,null,null,23.5]
[23.625,731,23.625,711.32100000000003,null,218,27.125,731,null,null,null,null,null,null,null,null,null,218,{"$error":"#REF!"},{"$error":"#REF!"},null,null,null,null,null,null,null,null,null,null,null,null,null,null,null,null,null,null,null,23.625]
[23.75,731,23.75,706.41,null,219,27.25,731,null,null,null,null,null,null,null,null,null,219,{"$error":"#REF!"},{"$error":"#REF!"},null,null,null,null,null,null,null,null,null,null,null,null,null,null,null,null,null,null,null,23.75]
[23.875,731,23.875,691.67899999999997,null,220,27.375,731,null,null,null,null,null,null,null,null,null,220,{"$error":"#REF!"},{"$error":"#REF!"},null,null,null,null,null,null,null,null,null,null,null,null,null,null,null,null,null,null,null,23.875]
[24,731,24,681.85799999999995,null,221,27.5,731,null,null,null,null,null,null,null,null,null,221,{"$error":"#REF!"},{"$error":"#REF!"},null,null,null,null,null,null,null,null,null,null,null,null,null,null,null,null,null,null,null,24]
[24.125,731,24.125,677.298,null,222,27.625,731,null,null,null,null,null,null,null,null,null,222,{"$error":"#REF!"},{"$error":"#REF!"},null,null,null,null,null,null,null,null,null,null,null,null,null,null,null,null,null,null,null,24.125]
[24.25,731,24.25,663.61900000000003,null,223,27.75,731,null,null,null,null,null,null,null,null,null,223,{"$error":"#REF!"},{"$error":"#REF!"},null,null,null,null,null,null,null,null,null,null,null,null,null,null,null,null,null,null,null,24.25]
[24.375,731,24.375,649.58900000000006,null,224,27.875,730,null,null,null,null,null,null,null,null,null,224,{"$error":"#REF!"},{"$error":"#REF!"},null,null,null,null,null,null,null,null,null,null,null,null,null,null,null,null,null,null,null,24.375]
[24.5,731,24.5,641.17100000000005,null,225,28,731,null,null,null,null,null,null,null,null,null,225,{"$error":"#REF!"},{"$error":"#REF!"},null,null,null,null,null,null,null,null,null,null,null,null,null,null,null,null,null,null,null,24.5]
[24.625,731,24.625,631.70000000000005,null,226,28.125,731,null,null,null,null,null,null,null,null,null,226,{"$error":"#REF!"},{"$error":"#REF!"},null,null,null,null,null,null,null,null,null,null,null,null,null,null,null,null,null,null,null,24.625]
[24.75,731,24.75,619.07299999999998,null,227,28.25,731,null,null,null,null,null,null,null,null,null,227,{"$error":"#REF!"},{"$error":"#REF!"},null,null,null,null,null,null,null,null,null,null,null,null,null,null,null,null,null,null,null,24.75]
[24.875,731,24.875,610.65499999999997,null,228,28.375,731,null,null,null,null,null,null,null,null,null,228,{"$error":"#REF!"},{"$error":"#REF!"},null,null,null,null,null,null,null,null,null,null,null,null,null,null,null,null,null,null,null,24.875]
[25,731,25,602.23699999999997,null,229,28.5,731,null,null,null,null,null,null,null,null,null,229,{"$error":"#REF!"},{"$error":"#REF!"},null,null,null,null,null,null,null,null,null,null,null,null,null,null,null,null,null,null,null,25]
[25.125,731,25.125,593.81899999999996,null,230,28.625,731,null,null,null,null,null,null,null,null,null,230,{"$error":"#REF!"},{"$error":"#REF!"},null,null,null,null,null,null,null,null,null,null,null,null,null,null,null,null,null,null,null,25.125]
[25.25,731,25.25,585.75199999999995,null,231,28.75,730,null,null,null,null,null,null,null,null,null,231,{"$error":"#REF!"},{"$error":"#REF!"},null,null,null,null,null,null,null,null,null,null,null,null,null,null,null,null,null,null,null,25.25]
[25.375,731,25.375,573.827,null,232,28.875,731,null,null,null,null,null,null,null,null,null,232,{"$error":"#REF!"},{"$error":"#REF!"},null,null,null,null,null,null,null,null,null,null,null,null,null,null,null,null,null,null,null,25.375]
[25.5,731,25.5,565.75900000000001,null,233,29,731,null,null,null,null,null,null,null,null,null,233,{"$error":"#REF!"},{"$error":"#REF!"},null,null,null,null,null,null,null,null,null,null,null,null,null,null,null,null,null,null,null,25.5]
[25.625,731,25.625,558.04300000000001,null,234,29.125,731,null,null,null,null,null,null,null,null,null,234,{"$error":"#REF!"},{"$error":"#REF!"},null,null,null,null,null,null,null,null,null,null,null,null,null,null,null,null,null,null,null,25.625]
[25.75,731,25.75,546.46799999999996,null,235,29.25,731,null,null,null,null,null,null,null,null,null,235,{"$error":"#REF!"},{"$error":"#REF!"},null,null,null,null,null,null,null,null,null,null,null,null,null,null,null,null,null,null,null,25.75]
[25.875,731,25.875,539.10199999999998,null,236,29.375,730,null,null,null,null,null,null,null,null,null,236,{"$error":"#REF!"},{"$error":"#REF!"},null,null,null,null,null,null,null,null,null,null,null,null,null,null,null,null,null,null,null,25.875]
[26,731,26,524.02,null,237,29.5,730,null,null,null,null,null,null,null,null,null,237,{"$error":"#REF!"},{"$error":"#REF!"},null,null,null,null,null,null,null,null,null,null,null,null,null,null,null,null,null,null,null,26]
[26.125,730,26.125,516.654,null,238,29.625,731,null,null,null,null,null,null,null,null,null,238,{"$error":"#REF!"},{"$error":"#REF!"},null,null,null,null,null,null,null,null,null,null,null,null,null,null,null,null,null,null,null,26.125]
[26.25,731,26.25,502.62400000000002,null,239,29.75,731,null,null,null,null,null,null,null,null,null,239,{"$error":"#REF!"},{"$error":"#REF!"},null,null,null,null,null,null,null,null,null,null,null,null,null,null,null,null,null,null,null,26.25]
[26.375,730,26.375,492.45299999999997,null,240,29.875,731,null,null,null,null,null,null,null,null,null,240,{"$error":"#REF!"},{"$error":"#REF!"},null,null,null,null,null,null,null,null,null,null,null,null,null,null,null,null,null,null,null,26.375]
[26.5,731,26.5,479.12400000000002,null,241,30,730,null,null,null,null,null,null,null,null,null,241,{"$error":"#REF!"},{"$error":"#REF!"},null,null,null,null,null,null,null,null,null,null,null,null,null,null,null,null,null,null,null,26.5]
[26.625,731,26.625,469.303,null,242,30.125,731,null,null,null,null,null,null,null,null,null,242,{"$error":"#REF!"},{"$error":"#REF!"},null,null,null,null,null,null,null,null,null,null,null,null,null,null,null,null,null,null,null,26.625]
[26.75,730,26.75,459.13099999999997,null,243,30.25,730,null,null,null,null,null,null,null,null,null,243,{"$error":"#REF!"},{"$error":"#REF!"},null,null,null,null,null,null,null,null,null,null,null,null,null,null,null,null,null,null,null,26.75]
[26.875,731,26.875,449.661,null,244,30.375,731,null,null,null,null,null,null,null,null,null,244,{"$error":"#REF!"},{"$error":"#REF!"},null,null,null,null,null,null,null,null,null,null,null,null,null,null,null,null,null,null,null,26.875]
[27,731,27,443.69799999999998,null,245,30.5,731,null,null,null,null,null,null,null,null,null,245,{"$error":"#REF!"},{"$error":"#REF!"},null,null,null,null,null,null,null,null,null,null,null,null,null,null,null,null,null,null,null,27]
[27.125,731,27.125,440.54199999999997,null,246,30.625,731,null,null,null,null,null,null,null,null,null,246,{"$error":"#REF!"},{"$error":"#REF!"},null,null,null,null,null,null,null,null,null,null,null,null,null,null,null,null,null,null,null,27.125]
[27.25,731,27.25,434.57900000000001,null,247,30.75,731,null,null,null,null,null,null,null,null,null,247,{"$error":"#REF!"},{"$error":"#REF!"},null,null,null,null,null,null,null,null,null,null,null,null,null,null,null,null,null,null,null,27.25]
[27.375,731,27.375,434.57900000000001,null,248,30.875,731,null,null,null,null,null,null,null,null,null,248,{"$error":"#REF!"},{"$error":"#REF!"},null,null,null,null,null,null,null,null,null,null,null,null,null,null,null,null,null,null,null,27.375]
[27.5,731,27.5,434.57900000000001,null,249,31,731,null,null,null,null,null,null,null,null,null,249,{"$error":"#REF!"},{"$error":"#REF!"},null,null,null,null,null,null,null,null,null,null,null,null,null,null,null,null,null,null,null,27.5]
[27.625,731,27.625,434.57900000000001,null,250,31.125,730,null,null,null,null,null,null,null,null,null,250,{"$error":"#REF!"},{"$error":"#REF!"},null,null,null,null,null,null,null,null,null,null,null,null,null,null,null,null,null,null,null,27.625]
[27.75,731,27.75,437.73599999999999,null,251,31.25,730,null,null,null,null,null,null,null,null,null,251,{"$error":"#REF!"},{"$error":"#REF!"},null,null,null,null,null,null,null,null,null,null,null,null,null,null,null,null,null,null,null,27.75]
[27.875,730,27.875,440.54199999999997,null,252,31.375,731,null,null,null,null,null,null,null,null,null,252,{"$error":"#REF!"},{"$error":"#REF!"},null,null,null,null,null,null,null,null,null,null,null,null,null,null,null,null,null,null,null,27.875]
[28,731,28,446.85500000000002,null,253,31.5,731,null,null,null,null,null,null,null,null,null,253,{"$error":"#REF!"},{"$error":"#REF!"},null,null,null,null,null,null,null,null,null,null,null,null,null,null,null,null,null,null,null,28]
[28.125,731,28.125,453.16899999999998,null,254,31.625,730,null,null,null,null,null,null,null,null,null,254,{"$error":"#REF!"},{"$error":"#REF!"},null,null,null,null,null,null,null,null,null,null,null,null,null,null,null,null,null,null,null,28.125]
[28.25,731,28.25,459.13099999999997,null,255,31.75,731,null,null,null,null,null,null,null,null,null,255,{"$error":"#REF!"},{"$error":"#REF!"},null,null,null,null,null,null,null,null,null,null,null,null,null,null,null,null,null,null,null,28.25]
[28.375,731,28.375,469.303,null,256,31.875,731,null,null,null,null,null,null,null,null,null,256,{"$error":"#REF!"},{"$error":"#REF!"},null,null,null,null,null,null,null,null,null,null,null,null,null,null,null,null,null,null,null,28.375]
[28.5,731,28.5,475.61700000000002,null,257,32,731,null,null,null,null,null,null,null,null,null,257,{"$error":"#REF!"},{"$error":"#REF!"},null,null,null,null,null,null,null,null,null,null,null,null,null,null,null,null,null,null,null,28.5]
[28.625,731,28.625,486.13900000000001,null,258,{"$f":"INDEX($A$200:$A$1200,MATCH(\"t in*\",$A$200:$A$1200,0)+F518)","v":32.125},{"$f":"INDEX($B$200:$B$1200,MATCH(\"t in*\",$A$200:$A$1200,0)+F518)","v":731},null,null,null,null,null,null,null,null,null,258,{"$f":"INDEX($C$1:$C$500,MATCH(\"t in*\",$C$1:$C$500,0)+R515)","v":{"$error":"#REF!"}},{"$error":"#REF!"},null,null,null,null,null,null,null,null,null,null,null,null,null,null,null,null,null,null,null,28.625]
[28.75,730,28.75,492.45299999999997,null,259,32.25,731,null,null,null,null,null,null,null,null,null,{"$f":"R518+1","v":259},{"$error":"#REF!"},{"$f":"INDEX($D$1:$D$500,MATCH(\"t in*\",$C$1:$C$500,0)+R516)","v":{"$error":"#REF!"}},null,null,null,null,null,null,null,null,null,null,null,null,null,null,null,null,null,null,null,28.75]
[28.875,731,28.875,502.62400000000002,null,260,32.375,731,null,null,null,null,null,null,null,null,null,260,{"$error":"#REF!"},{"$error":"#REF!"},null,null,null,null,null,null,null,null,null,null,null,null,null,null,null,null,null,null,null,28.875]
[29,731,29,513.14700000000005,null,261,32.5,731,null,null,null,null,null,null,null,null,null,261,{"$error":"#REF!"},{"$error":"#REF!"},null,null,null,null,null,null,null,null,null,null,null,null,null,null,null,null,null,null,null,29]
[29.125,731,29.125,524.02,null,262,32.625,730,null,null,null,null,null,null,null,null,null,262,{"$error":"#REF!"},{"$error":"#REF!"},null,null,null,null,null,null,null,null,null,null,null,null,null,null,null,null,null,null,null,29.125]
[29.25,731,29.25,535.24400000000003,null,263,32.75,731,null,null,null,null,null,null,null,null,null,263,{"$error":"#REF!"},{"$error":"#REF!"},null,null,null,null,null,null,null,null,null,null,null,null,null,null,null,null,null,null,null,29.25]
[29.375,730,29.375,546.46799999999996,null,264,32.875,730,null,null,null,null,null,null,null,null,null,264,{"$error":"#REF!"},{"$error":"#REF!"},null,null,null,null,null,null,null,null,null,null,null,null,null,null,null,null,null,null,null,29.375]
[29.5,730,29.5,558.04300000000001,null,265,33,731,null,null,null,null,null,null,null,null,null,265,{"$error":"#REF!"},{"$error":"#REF!"},null,null,null,null,null,null,null,null,null,null,null,null,null,null,null,null,null,null,null,29.5]
[29.625,731,29.625,569.96799999999996,null,266,33.125,730,null,null,null,null,null,null,null,null,null,266,{"$error":"#REF!"},{"$error":"#REF!"},null,null,null,null,null,null,null,null,null,null,null,null,null,null,null,null,null,null,null,29.625]
[29.75,731,29.75,581.89400000000001,null,267,33.25,731,null,null,null,null,null,null,null,null,null,267,{"$error":"#REF!"},{"$error":"#REF!"},null,null,null,null,null,null,null,null,null,null,null,null,null,null,null,null,null,null,null,29.75]
[29.875,731,29.875,589.61,null,268,33.375,731,null,null,null,null,null,null,null,null,null,268,{"$error":"#REF!"},{"$error":"#REF!"},null,null,null,null,null,null,null,null,null,null,null,null,null,null,null,null,null,null,null,29.875]
[30,730,30,606.44600000000003,null,269,33.5,731,null,null,null,null,null,null,null,null,null,269,{"$error":"#REF!"},{"$error":"#REF!"},null,null,null,null,null,null,null,null,null,null,null,null,null,null,null,null,null,null,null,30]
[30.125,731,30.125,614.86400000000003,null,270,33.625,730,null,null,null,null,null,null,null,null,null,270,{"$error":"#REF!"},{"$error":"#REF!"},null,null,null,null,null,null,null,null,null,null,null,null,null,null,null,null,null,null,null,30.125]
[30.25,730,30.25,623.28200000000004,null,271,33.75,731,null,null,null,null,null,null,null,null,null,271,{"$error":"#REF!"},{"$error":"#REF!"},null,null,null,null,null,null,null,null,null,null,null,null,null,null,null,null,null,null,null,30.25]
[30.375,731,30.375,636.26,null,272,33.875,730,null,null,null,null,null,null,null,null,null,272,{"$error":"#REF!"},{"$error":"#REF!"},null,null,null,null,null,null,null,null,null,null,null,null,null,null,null,null,null,null,null,30.375]
[30.5,731,30.5,649.58900000000006,null,273,34,731,null,null,null,null,null,null,null,null,null,273,{"$error":"#REF!"},{"$error":"#REF!"},null,null,null,null,null,null,null,null,null,null,null,null,null,null,null,null,null,null,null,30.5]
[30.625,731,30.625,654.49900000000002,null,274,34.125,731,null,null,null,null,null,null,null,null,null,274,{"$error":"#REF!"},{"$error":"#REF!"},null,null,null,null,null,null,null,null,null,null,null,null,null,null,null,null,null,null,null,30.625]
[30.75,731,30.75,668.178,null,275,34.25,731,null,null,null,null,null,null,null,null,null,275,{"$error":"#REF!"},{"$error":"#REF!"},null,null,null,null,null,null,null,null,null,null,null,null,null,null,null,null,null,null,null,30.75]
[30.875,731,30.875,672.73800000000006,null,276,34.375,731,null,null,null,null,null,null,null,null,null,276,{"$error":"#REF!"},{"$error":"#REF!"},null,null,null,null,null,null,null,null,null,null,null,null,null,null,null,null,null,null,null,30.875]
[31,731,31,681.85799999999995,null,277,34.5,731,null,null,null,null,null,null,null,null,null,277,{"$error":"#REF!"},{"$error":"#REF!"},null,null,null,null,null,null,null,null,null,null,null,null,null,null,null,null,null,null,null,31]
[31.125,730,31.125,691.67899999999997,null,{"$f":"F537+1","v":278},34.625,731,null,null,null,null,null,null,null,null,null,278,{"$error":"#REF!"},{"$error":"#REF!"},null,null,null,null,null,null,null,null,null,null,null,null,null,null,null,null,null,null,null,31.125]
[31.25,730,31.25,696.23800000000006,null,279,34.75,730,null,null,null,null,null,null,null,null,null,279,{"$error":"#REF!"},{"$error":"#REF!"},null,null,null,null,null,null,null,null,null,null,null,null,null,null,null,null,null,null,null,31.25]
[31.375,731,31.375,706.41,null,280,34.875,731,null,null,null,null,null,null,null,null,null,280,{"$error":"#REF!"},{"$error":"#REF!"},null,null,null,null,null,null,null,null,null,null,null,null,null,null,null,null,null,null,null,31.375]
[31.5,731,31.5,716.23099999999999,null,281,35,731,null,null,null,null,null,null,null,null,null,281,{"$error":"#REF!"},{"$error":"#REF!"},null,null,null,null,null,null,null,null,null,null,null,null,null,null,null,null,null,null,null,31.5]
[31.625,730,31.625,721.14200000000005,null,282,35.125,731,null,null,null,null,null,null,null,null,null,282,{"$error":"#REF!"},{"$error":"#REF!"},null,null,null,null,null,null,null,null,null,null,null,null,null,null,null,null,null,null,null,31.625]
[31.75,731,31.75,726.05200000000002,null,283,35.25,731,null,null,null,null,null,null,null,null,null,283,{"$error":"#REF!"},{"$error":"#REF!"},null,null,null,null,null,null,null,null,null,null,null,null,null,null,null,null,null,null,null,31.75]
[31.875,731,31.875,730.96299999999997,null,284,35.375,731,null,null,null,null,null,null,null,null,null,284,{"$error":"#REF!"},{"$error":"#REF!"},null,null,null,null,null,null,null,null,null,null,null,null,null,null,null,null,null,null,null,31.875]
[32,731,32,741.48500000000001,null,285,35.5,731,null,null,null,null,null,null,null,null,null,285,{"$error":"#REF!"},{"$error":"#REF!"},null,null,null,null,null,null,null,null,null,null,null,null,null,null,null,null,null,null,null,32]
[32.125,731,32.125,741.48500000000001,null,286,35.625,730,null,null,null,null,null,null,null,null,null,286,{"$error":"#REF!"},{"$error":"#REF!"},null,null,null,null,null,null,null,null,null,null,null,null,null,null,null,null,null,null,null,32.125]
[32.25,731,32.25,746.39599999999996,null,287,35.75,731,null,null,null,null,null,null,null,null,null,287,{"$error":"#REF!"},{"$error":"#REF!"},null,null,null,null,null,null,null,null,null,null,null,null,null,null,null,null,null,null,null,32.25]
[32.375,731,32.375,746.39599999999996,null,288,35.875,730,null,null,null,null,null,null,null,null,null,288,{"$error":"#REF!"},{"$error":"#REF!"},null,null,null,null,null,null,null,null,null,null,null,null,null,null,null,null,null,null,null,32.375]
[32.5,731,32.5,752.00800000000004,null,289,36,731,null,null,null,null,null,null,null,null,null,289,{"$error":"#REF!"},{"$error":"#REF!"},null,null,null,null,null,null,null,null,null,null,null,null,null,null,null,null,null,null,null,32.5]
[32.625,730,32.625,752.00800000000004,null,290,36.125,731,null,null,null,null,null,null,null,null,null,290,{"$error":"#REF!"},{"$error":"#REF!"},null,null,null,null,null,null,null,null,null,null,null,null,null,null,null,null,null,null,null,32.625]
[32.75,731,32.75,746.39599999999996,null,291,36.25,731,null,null,null,null,null,null,null,null,null,291,{"$error":"#REF!"},{"$error":"#REF!"},null,null,null,null,null,null,null,null,null,null,null,null,null,null,null,null,null,null,null,32.75]
[32.875,730,32.875,746.39599999999996,null,292,36.375,731,null,null,null,null,null,null,null,null,null,292,{"$error":"#REF!"},{"$error":"#REF!"},null,null,null,null,null,null,null,null,null,null,null,null,null,null,null,null,null,null,null,32.875]
[33,731,33,741.48500000000001,null,293,36.5,731,null,null,null,null,null,null,null,null,null,293,{"$error":"#REF!"},{"$error":"#REF!"},null,null,null,null,null,null,null,null,null,null,null,null,null,null,null,null,null,null,null,33]
[33.125,730,33.125,736.57500000000005,null,294,36.625,731,null,null,null,null,null,null,null,null,null,294,{"$error":"#REF!"},{"$error":"#REF!"},null,null,null,null,null,null,null,null,null,null,null,null,null,null,null,null,null,null,null,33.125]
[33.25,731,33.25,730.96299999999997,null,295,36.75,731,null,null,null,null,null,null,null,null,null,295,{"$error":"#REF!"},{"$error":"#REF!"},null,null,null,null,null,null,null,null,null,null,null,null,null,null,null,null,null,null,null,33.25]
[33.375,731,33.375,726.05200000000002,null,296,36.875,731,null,null,null,null,null,null,null,null,null,296,{"$error":"#REF!"},{"$error":"#REF!"},null,null,null,null,null,null,null,null,null,null,null,null,null,null,null,null,null,null,null,33.375]
[33.5,731,33.5,716.23099999999999,null,297,37,730,null,null,null,null,null,null,null,null,null,297,{"$error":"#REF!"},{"$error":"#REF!"},null,null,null,null,null,null,null,null,null,null,null,null,null,null,null,null,null,null,null,33.5]
[33.625,730,33.625,711.32100000000003,null,298,37.125,731,null,null,null,null,null,null,null,null,null,298,{"$error":"#REF!"},{"$error":"#REF!"},null,null,null,null,null,null,null,null,null,null,null,null,null,null,null,null,null,null,null,33.625]
[33.75,731,33.75,701.5,null,299,37.25,731,null,null,null,null,null,null,null,null,null,299,{"$error":"#REF!"},{"$error":"#REF!"},null,null,null,null,null,null,null,null,null,null,null,null,null,null,null,null,null,null,null,33.75]
[33.875,730,33.875,687.11900000000003,null,300,37.375,731,null,null,null,null,null,null,null,null,null,300,{"$error":"#REF!"},{"$error":"#REF!"},null,null,null,null,null,null,null,null,null,null,null,null,null,null,null,null,null,null,null,33.875]
[34,731,34,681.85799999999995,null,301,37.5,731,null,null,null,null,null,null,null,null,null,301,{"$error":"#REF!"},{"$error":"#REF!"},null,null,null,null,null,null,null,null,null,null,null,null,null,null,null,null,null,null,null,34]
[34.125,731,34.125,672.73800000000006,null,302,37.625,731,null,null,null,null,null,null,null,null,null,302,{"$error":"#REF!"},{"$error":"#REF!"},null,null,null,null,null,null,null,null,null,null,null,null,null,null,null,null,null,null,null,34.125]
[34.25,731,34.25,659.05899999999997,null,303,37.75,731,null,null,null,null,null,null,null,null,null,303,{"$error":"#REF!"},{"$error":"#REF!"},null,null,null,null,null,null,null,null,null,null,null,null,null,null,null,null,null,null,null,34.25]
[34.375,731,34.375,649.58900000000006,null,304,37.875,731,null,null,null,null,null,null,null,null,null,304,{"$error":"#REF!"},{"$error":"#REF!"},null,null,null,null,null,null,null,null,null,null,null,null,null,null,null,null,null,null,null,34.375]
[34.5,731,34.5,636.26,null,305,38,730,null,null,null,null,null,null,null,null,null,305,{"$error":"#REF!"},{"$error":"#REF!"},null,null,null,null,null,null,null,null,null,null,null,null,null,null,null,null,null,null,null,34.5]
[34.625,731,34.625,627.49099999999999,null,306,38.125,731,null,null,null,null,null,null,null,null,null,306,{"$error":"#REF!"},{"$error":"#REF!"},null,null,null,null,null,null,null,null,null,null,null,null,null,null,null,null,null,null,null,34.625]
[34.75,730,34.75,619.07299999999998,null,307,38.25,731,null,null,null,null,null,null,null,null,null,307,{"$error":"#REF!"},{"$error":"#REF!"},null,null,null,null,null,null,null,null,null,null,null,null,null,null,null,null,null,null,null,34.75]
[34.875,731,34.875,610.65499999999997,null,308,38.375,730,null,null,null,null,null,null,null,null,null,308,{"$error":"#REF!"},{"$error":"#REF!"},null,null,null,null,null,null,null,null,null,null,null,null,null,null,null,null,null,null,null,34.875]
[35,731,35,602.23699999999997,null,309,38.5,730,null,null,null,null,null,null,null,null,null,309,{"$error":"#REF!"},{"$error":"#REF!"},null,null,null,null,null,null,null,null,null,null,null,null,null,null,null,null,null,null,null,35]
[35.125,731,35.125,593.81899999999996,null,310,38.625,731,null,null,null,null,null,null,null,null,null,310,{"$error":"#REF!"},{"$error":"#REF!"},null,null,null,null,null,null,null,null,null,null,null,null,null,null,null,null,null,null,null,35.125]
[35.25,731,35.25,581.89400000000001,null,311,38.75,731,null,null,null,null,null,null,null,null,null,311,{"$error":"#REF!"},{"$error":"#REF!"},null,null,null,null,null,null,null,null,null,null,null,null,null,null,null,null,null,null,null,35.25]
[35.375,731,35.375,573.827,null,312,38.875,730,null,null,null,null,null,null,null,null,null,312,{"$error":"#REF!"},{"$error":"#REF!"},null,null,null,null,null,null,null,null,null,null,null,null,null,null,null,null,null,null,null,35.375]
[35.5,731,35.5,569.96799999999996,null,313,39,730,null,null,null,null,null,null,null,null,null,313,{"$error":"#REF!"},{"$error":"#REF!"},null,null,null,null,null,null,null,null,null,null,null,null,null,null,null,null,null,null,null,35.5]
[35.625,730,35.625,558.04300000000001,null,314,39.125,731,null,null,null,null,null,null,null,null,null,314,{"$error":"#REF!"},{"$error":"#REF!"},null,null,null,null,null,null,null,null,null,null,null,null,null,null,null,null,null,null,null,35.625]
[35.75,731,35.75,546.46799999999996,null,315,39.25,731,null,null,null,null,null,null,null,null,null,315,{"$error":"#REF!"},{"$error":"#REF!"},null,null,null,null,null,null,null,null,null,null,null,null,null,null,null,null,null,null,null,35.75]
[35.875,730,35.875,539.10199999999998,null,316,39.375,731,null,null,null,null,null,null,null,null,null,316,{"$error":"#REF!"},{"$error":"#REF!"},null,null,null,null,null,null,null,null,null,null,null,null,null,null,null,null,null,null,null,35.875]
[36,731,36,527.52800000000002,null,317,39.5,731,null,null,null,null,null,null,null,null,null,317,{"$error":"#REF!"},{"$error":"#REF!"},null,null,null,null,null,null,null,null,null,null,null,null,null,null,null,null,null,null,null,36]
[36.125,731,36.125,520.51300000000003,null,318,39.625,731,null,null,null,null,null,null,null,null,null,318,{"$error":"#REF!"},{"$error":"#REF!"},null,null,null,null,null,null,null,null,null,null,null,null,null,null,null,null,null,null,null,36.125]
[36.25,731,36.25,506.13200000000001,null,319,39.75,731,null,null,null,null,null,null,null,null,null,319,{"$error":"#REF!"},{"$error":"#REF!"},null,null,null,null,null,null,null,null,null,null,null,null,null,null,null,null,null,null,null,36.25]
[36.375,731,36.375,495.96,null,320,39.875,731,null,null,null,null,null,null,null,null,null,320,{"$error":"#REF!"},{"$error":"#REF!"},null,null,null,null,null,null,null,null,null,null,null,null,null,null,null,null,null,null,null,36.375]
[36.5,731,36.5,486.13900000000001,null,321,40,730,null,null,null,null,null,null,null,null,null,321,{"$error":"#REF!"},{"$error":"#REF!"},null,null,null,null,null,null,null,null,null,null,null,null,null,null,null,null,null,null,null,36.5]
[36.625,731,36.625,475.61700000000002,null,322,{"$f":"INDEX($A$200:$A$1200,MATCH(\"t in*\",$A$200:$A$1200,0)+F582)","v":40.125},{"$f":"INDEX($B$200:$B$1200,MATCH(\"t in*\",$A$200:$A$1200,0)+F582)","v":730},null,null,null,null,null,null,null,null,null,322,{"$f":"INDEX($C$1:$C$500,MATCH(\"t in*\",$C$1:$C$500,0)+R579)","v":{"$error":"#REF!"}},{"$error":"#REF!"},null,null,null,null,null,null,null,null,null,null,null,null,null,null,null,null,null,null,null,36.625]
[36.75,731,36.75,462.99,null,323,40.25,731,null,null,null,null,null,null,null,null,null,{"$f":"R582+1","v":323},{"$error":"#REF!"},{"$f":"INDEX($D$1:$D$500,MATCH(\"t in*\",$C$1:$C$500,0)+R580)","v":{"$error":"#REF!"}},null,null,null,null,null,null,null,null,null,null,null,null,null,null,null,null,null,null,null,36.75]
[36.875,731,36.875,453.16899999999998,null,324,40.375,731,null,null,null,null,null,null,null,null,null,324,{"$error":"#REF!"},{"$error":"#REF!"},null,null,null,null,null,null,null,null,null,null,null,null,null,null,null,null,null,null,null,36.875]
[37,730,37,446.85500000000002,null,325,40.5,731,null,null,null,null,null,null,null,null,null,325,{"$error":"#REF!"},{"$error":"#REF!"},null,null,null,null,null,null,null,null,null,null,null,null,null,null,null,null,null,null,null,37]
[37.125,731,37.125,443.69799999999998,null,326,40.625,731,null,null,null,null,null,null,null,null,null,326,{"$error":"#REF!"},{"$error":"#REF!"},null,null,null,null,null,null,null,null,null,null,null,null,null,null,null,null,null,null,null,37.125]
[37.25,731,37.25,437.73599999999999,null,327,40.75,731,null,null,null,null,null,null,null,null,null,327,{"$error":"#REF!"},{"$error":"#REF!"},null,null,null,null,null,null,null,null,null,null,null,null,null,null,null,null,null,null,null,37.25]
[37.375,731,37.375,437.73599999999999,null,328,40.875,731,null,null,null,null,null,null,null,null,null,328,{"$error":"#REF!"},{"$error":"#REF!"},null,null,null,null,null,null,null,null,null,null,null,null,null,null,null,null,null,null,null,37.375]
[37.5,731,37.5,437.73599999999999,null,329,41,730,null,null,null,null,null,null,null,null,null,329,{"$error":"#REF!"},{"$error":"#REF!"},null,null,null,null,null,null,null,null,null,null,null,null,null,null,null,null,null,null,null,37.5]
[37.625,731,37.625,437.73599999999999,null,330,41.125,730,null,null,null,null,null,null,null,null,null,330,{"$error":"#REF!"},{"$error":"#REF!"},null,null,null,null,null,null,null,null,null,null,null,null,null,null,null,null,null,null,null,37.625]
[37.75,731,37.75,440.54199999999997,null,331,41.25,730,null,null,null,null,null,null,null,null,null,331,{"$error":"#REF!"},{"$error":"#REF!"},null,null,null,null,null,null,null,null,null,null,null,null,null,null,null,null,null,null,null,37.75]
[37.875,731,37.875,446.85500000000002,null,332,41.375,731,null,null,null,null,null,null,null,null,null,332,{"$error":"#REF!"},{"$error":"#REF!"},null,null,null,null,null,null,null,null,null,null,null,null,null,null,null,null,null,null,null,37.875]
[38,730,38,453.16899999999998,null,333,41.5,731,null,null,null,null,null,null,null,null,null,333,{"$error":"#REF!"},{"$error":"#REF!"},null,null,null,null,null,null,null,null,null,null,null,null,null,null,null,null,null,null,null,38]
[38.125,731,38.125,456.32499999999999,null,334,41.625,731,null,null,null,null,null,null,null,null,null,334,{"$error":"#REF!"},{"$error":"#REF!"},null,null,null,null,null,null,null,null,null,null,null,null,null,null,null,null,null,null,null,38.125]
[38.25,731,38.25,466.14600000000002,null,335,41.75,730,null,null,null,null,null,null,null,null,null,335,{"$error":"#REF!"},{"$error":"#REF!"},null,null,null,null,null,null,null,null,null,null,null,null,null,null,null,null,null,null,null,38.25]
[38.375,730,38.375,469.303,null,336,41.875,731,null,null,null,null,null,null,null,null,null,336,{"$error":"#REF!"},{"$error":"#REF!"},null,null,null,null,null,null,null,null,null,null,null,null,null,null,null,null,null,null,null,38.375]
[38.5,730,38.5,482.28100000000001,null,337,42,731,null,null,null,null,null,null,null,null,null,337,{"$error":"#REF!"},{"$error":"#REF!"},null,null,null,null,null,null,null,null,null,null,null,null,null,null,null,null,null,null,null,38.5]
[38.625,731,38.625,486.13900000000001,null,338,42.125,731,null,null,null,null,null,null,null,null,null,338,{"$error":"#REF!"},{"$error":"#REF!"},null,null,null,null,null,null,null,null,null,null,null,null,null,null,null,null,null,null,null,38.625]
[38.75,731,38.75,495.96,null,339,42.25,731,null,null,null,null,null,null,null,null,null,339,{"$error":"#REF!"},{"$error":"#REF!"},null,null,null,null,null,null,null,null,null,null,null,null,null,null,null,null,null,null,null,38.75]
[38.875,730,38.875,506.13200000000001,null,340,42.375,731,null,null,null,null,null,null,null,null,null,340,{"$error":"#REF!"},{"$error":"#REF!"},null,null,null,null,null,null,null,null,null,null,null,null,null,null,null,null,null,null,null,38.875]
[39,730,39,516.654,null,341,42.5,731,null,null,null,null,null,null,null,null,null,341,{"$error":"#REF!"},{"$error":"#REF!"},null,null,null,null,null,null,null,null,null,null,null,null,null,null,null,null,null,null,null,39]
[39.125,731,39.125,531.73699999999997,null,{"$f":"F601+1","v":342},42.625,730,null,null,null,null,null,null,null,null,null,342,{"$error":"#REF!"},{"$error":"#REF!"},null,null,null,null,null,null,null,null,null,null,null,null,null,null,null,null,null,null,null,39.125]
[39.25,731,39.25,542.61,null,343,42.75,730,null,null,null,null,null,null,null,null,null,343,{"$error":"#REF!"},{"$error":"#REF!"},null,null,null,null,null,null,null,null,null,null,null,null,null,null,null,null,null,null,null,39.25]
[39.375,731,39.375,553.83399999999995,null,344,42.875,730,null,null,null,null,null,null,null,null,null,344,{"$error":"#REF!"},{"$error":"#REF!"},null,null,null,null,null,null,null,null,null,null,null,null,null,null,null,null,null,null,null,39.375]
[39.5,731,39.5,565.75900000000001,null,345,43,731,null,null,null,null,null,null,null,null,null,345,{"$error":"#REF!"},{"$error":"#REF!"},null,null,null,null,null,null,null,null,null,null,null,null,null,null,null,null,null,null,null,39.5]
[39.625,731,39.625,573.827,null,346,43.125,730,null,null,null,null,null,null,null,null,null,346,{"$error":"#REF!"},{"$error":"#REF!"},null,null,null,null,null,null,null,null,null,null,null,null,null,null,null,null,null,null,null,39.625]
[39.75,731,39.75,585.75199999999995,null,347,43.25,730,null,null,null,null,null,null,null,null,null,347,{"$error":"#REF!"},{"$error":"#REF!"},null,null,null,null,null,null,null,null,null,null,null,null,null,null,null,null,null,null,null,39.75]
[39.875,731,39.875,598.37900000000002,null,348,43.375,731,null,null,null,null,null,null,null,null,null,348,{"$error":"#REF!"},{"$error":"#REF!"},null,null,null,null,null,null,null,null,null,null,null,null,null,null,null,null,null,null,null,39.875]
[40,730,40,610.65499999999997,null,349,43.5,731,null,null,null,null,null,null,null,null,null,349,{"$error":"#REF!"},{"$error":"#REF!"},null,null,null,null,null,null,null,null,null,null,null,null,null,null,null,null,null,null,null,40]
[40.125,730,40.125,619.07299999999998,null,350,43.625,731,null,null,null,null,null,null,null,null,null,350,{"$error":"#REF!"},{"$error":"#REF!"},null,null,null,null,null,null,null,null,null,null,null,null,null,null,null,null,null,null,null,40.125]
[40.25,731,40.25,631.70000000000005,null,351,43.75,731,null,null,null,null,null,null,null,null,null,351,{"$error":"#REF!"},{"$error":"#REF!"},null,null,null,null,null,null,null,null,null,null,null,null,null,null,null,null,null,null,null,40.25]
[40.375,731,40.375,641.17100000000005,null,352,43.875,730,null,null,null,null,null,null,null,null,null,352,{"$error":"#REF!"},{"$error":"#REF!"},null,null,null,null,null,null,null,null,null,null,null,null,null,null,null,null,null,null,null,40.375]
[40.5,731,40.5,654.49900000000002,null,353,44,731,null,null,null,null,null,null,null,null,null,353,{"$error":"#REF!"},{"$error":"#REF!"},null,null,null,null,null,null,null,null,null,null,null,null,null,null,null,null,null,null,null,40.5]
[40.625,731,40.625,663.61900000000003,null,354,44.125,731,null,null,null,null,null,null,null,null,null,354,{"$error":"#REF!"},{"$error":"#REF!"},null,null,null,null,null,null,null,null,null,null,null,null,null,null,null,null,null,null,null,40.625]
[40.75,731,40.75,672.73800000000006,null,355,44.25,731,null,null,null,null,null,null,null,null,null,355,{"$error":"#REF!"},{"$error":"#REF!"},null,null,null,null,null,null,null,null,null,null,null,null,null,null,null,null,null,null,null,40.75]
[40.875,731,40.875,681.85799999999995,null,356,44.375,731,null,null,null,null,null,null,null,null,null,356,{"$error":"#REF!"},{"$error":"#REF!"},null,null,null,null,null,null,null,null,null,null,null,null,null,null,null,null,null,null,null,40.875]
[41,730,41,691.67899999999997,null,357,44.5,731,null,null,null,null,null,null,null,null,null,357,{"$error":"#REF!"},{"$error":"#REF!"},null,null,null,null,null,null,null,null,null,null,null,null,null,null,null,null,null,null,null,41]
[41.125,730,41.125,696.23800000000006,null,358,44.625,731,null,null,null,null,null,null,null,null,null,358,{"$error":"#REF!"},{"$error":"#REF!"},null,null,null,null,null,null,null,null,null,null,null,null,null,null,null,null,null,null,null,41.125]
[41.25,730,41.25,706.41,null,359,44.75,731,null,null,null,null,null,null,null,null,null,359,{"$error":"#REF!"},{"$error":"#REF!"},null,null,null,null,null,null,null,null,null,null,null,null,null,null,null,null,null,null,null,41.25]
[41.375,731,41.375,716.23099999999999,null,360,44.875,731,null,null,null,null,null,null,null,null,null,360,{"$error":"#REF!"},{"$error":"#REF!"},null,null,null,null,null,null,null,null,null,null,null,null,null,null,null,null,null,null,null,41.375]
[41.5,731,41.5,721.14200000000005,null,361,45,730,null,null,null,null,null,null,null,null,null,361,{"$error":"#REF!"},{"$error":"#REF!"},null,null,null,null,null,null,null,null,null,null,null,null,null,null,null,null,null,null,null,41.5]
[41.625,731,41.625,730.96299999999997,null,362,45.125,730,null,null,null,null,null,null,null,null,null,362,{"$error":"#REF!"},{"$error":"#REF!"},null,null,null,null,null,null,null,null,null,null,null,null,null,null,null,null,null,null,null,41.625]
[41.75,730,41.75,736.57500000000005,null,363,45.25,729,null,null,null,null,null,null,null,null,null,363,{"$error":"#REF!"},{"$error":"#REF!"},null,null,null,null,null,null,null,null,null,null,null,null,null,null,null,null,null,null,null,41.75]
[41.875,731,41.875,746.39599999999996,null,364,45.375,730,null,null,null,null,null,null,null,null,null,364,{"$error":"#REF!"},{"$error":"#REF!"},null,null,null,null,null,null,null,null,null,null,null,null,null,null,null,null,null,null,null,41.875]
[42,731,42,746.39599999999996,null,365,45.5,730,null,null,null,null,null,null,null,null,null,365,{"$error":"#REF!"},{"$error":"#REF!"},null,null,null,null,null,null,null,null,null,null,null,null,null,null,null,null,null,null,null,42]
[42.125,731,42.125,752.00800000000004,null,366,45.625,731,null,null,null,null,null,null,null,null,null,366,{"$error":"#REF!"},{"$error":"#REF!"},null,null,null,null,null,null,null,null,null,null,null,null,null,null,null,null,null,null,null,42.125]
[42.25,731,42.25,752.00800000000004,null,367,45.75,731,null,null,null,null,null,null,null,null,null,367,{"$error":"#REF!"},{"$error":"#REF!"},null,null,null,null,null,null,null,null,null,null,null,null,null,null,null,null,null,null,null,42.25]
[42.375,731,42.375,756.91800000000001,null,368,45.875,731,null,null,null,null,null,null,null,null,null,368,{"$error":"#REF!"},{"$error":"#REF!"},null,null,null,null,null,null,null,null,null,null,null,null,null,null,null,null,null,null,null,42.375]
[42.5,731,42.5,756.91800000000001,null,369,46,731,null,null,null,null,null,null,null,null,null,369,{"$error":"#REF!"},{"$error":"#REF!"},null,null,null,null,null,null,null,null,null,null,null,null,null,null,null,null,null,null,null,42.5]
[42.625,730,42.625,756.91800000000001,null,370,46.125,731,null,null,null,null,null,null,null,null,null,370,{"$error":"#REF!"},{"$error":"#REF!"},null,null,null,null,null,null,null,null,null,null,null,null,null,null,null,null,null,null,null,42.625]
[42.75,730,42.75,752.00800000000004,null,371,46.25,731,null,null,null,null,null,null,null,null,null,371,{"$error":"#REF!"},{"$error":"#REF!"},null,null,null,null,null,null,null,null,null,null,null,null,null,null,null,null,null,null,null,42.75]
[42.875,730,42.875,756.91800000000001,null,372,46.375,730,null,null,null,null,null,null,null,null,null,372,{"$error":"#REF!"},{"$error":"#REF!"},null,null,null,null,null,null,null,null,null,null,null,null,null,null,null,null,null,null,null,42.875]
[43,731,43,746.39599999999996,null,373,46.5,730,null,null,null,null,null,null,null,null,null,373,{"$error":"#REF!"},{"$error":"#REF!"},null,null,null,null,null,null,null,null,null,null,null,null,null,null,null,null,null,null,null,43]
[43.125,730,43.125,746.39599999999996,null,374,46.625,731,null,null,null,null,null,null,null,null,null,374,{"$error":"#REF!"},{"$error":"#REF!"},null,null,null,null,null,null,null,null,null,null,null,null,null,null,null,null,null,null,null,43.125]
[43.25,730,43.25,741.48500000000001,null,375,46.75,731,null,null,null,null,null,null,null,null,null,375,{"$error":"#REF!"},{"$error":"#REF!"},null,null,null,null,null,null,null,null,null,null,null,null,null,null,null,null,null,null,null,43.25]
[43.375,731,43.375,730.96299999999997,null,376,46.875,730,null,null,null,null,null,null,null,null,null,376,{"$error":"#REF!"},{"$error":"#REF!"},null,null,null,null,null,null,null,null,null,null,null,null,null,null,null,null,null,null,null,43.375]
[43.5,731,43.5,721.14200000000005,null,377,47,730,null,null,null,null,null,null,null,null,null,377,{"$error":"#REF!"},{"$error":"#REF!"},null,null,null,null,null,null,null,null,null,null,null,null,null,null,null,null,null,null,null,43.5]
[43.625,731,43.625,716.23099999999999,null,378,47.125,731,null,null,null,null,null,null,null,null,null,378,{"$error":"#REF!"},{"$error":"#REF!"},null,null,null,null,null,null,null,null,null,null,null,null,null,null,null,null,null,null,null,43.625]
[43.75,731,43.75,706.41,null,379,47.25,731,null,null,null,null,null,null,null,null,null,379,{"$error":"#REF!"},{"$error":"#REF!"},null,null,null,null,null,null,null,null,null,null,null,null,null,null,null,null,null,null,null,43.75]
[43.875,730,43.875,696.23800000000006,null,380,47.375,730,null,null,null,null,null,null,null,null,null,380,{"$error":"#REF!"},{"$error":"#REF!"},null,null,null,null,null,null,null,null,null,null,null,null,null,null,null,null,null,null,null,43.875]
[44,731,44,681.85799999999995,null,381,47.5,730,null,null,null,null,null,null,null,null,null,381,{"$error":"#REF!"},{"$error":"#REF!"},null,null,null,null,null,null,null,null,null,null,null,null,null,null,null,null,null,null,null,44]
[44.125,731,44.125,677.298,null,382,47.625,730,null,null,null,null,null,null,null,null,null,382,{"$error":"#REF!"},{"$error":"#REF!"},null,null,null,null,null,null,null,null,null,null,null,null,null,null,null,null,null,null,null,44.125]
[44.25,731,44.25,663.61900000000003,null,383,47.75,730,null,null,null,null,null,null,null,null,null,383,{"$error":"#REF!"},{"$error":"#REF!"},null,null,null,null,null,null,null,null,null,null,null,null,null,null,null,null,null,null,null,44.25]
[44.375,731,44.375,654.49900000000002,null,384,47.875,730,null,null,null,null,null,null,null,null,null,384,{"$error":"#REF!"},{"$error":"#REF!"},null,null,null,null,null,null,null,null,null,null,null,null,null,null,null,null,null,null,null,44.375]
[44.5,731,44.5,641.17100000000005,null,385,48,730,null,null,null,null,null,null,null,null,null,385,{"$error":"#REF!"},{"$error":"#REF!"},null,null,null,null,null,null,null,null,null,null,null,null,null,null,null,null,null,null,null,44.5]
[44.625,731,44.625,631.70000000000005,null,386,{"$f":"INDEX($A$200:$A$1200,MATCH(\"t in*\",$A$200:$A$1200,0)+F646)","v":48.125},{"$f":"INDEX($B$200:$B$1200,MATCH(\"t in*\",$A$200:$A$1200,0)+F646)","v":731},null,null,null,null,null,null,null,null,null,386,{"$f":"INDEX($C$1:$C$500,MATCH(\"t in*\",$C$1:$C$500,0)+R643)","v":{"$error":"#REF!"}},{"$error":"#REF!"},null,null,null,null,null,null,null,null,null,null,null,null,null,null,null,null,null,null,null,44.625]
[44.75,731,44.75,623.28200000000004,null,387,48.25,731,null,null,null,null,null,null,null,null,null,{"$f":"R646+1","v":387},{"$error":"#REF!"},{"$f":"INDEX($D$1:$D$500,MATCH(\"t in*\",$C$1:$C$500,0)+R644)","v":{"$error":"#REF!"}},null,null,null,null,null,null,null,null,null,null,null,null,null,null,null,null,null,null,null,44.75]
[44.875,731,44.875,614.86400000000003,null,388,48.375,731,null,null,null,null,null,null,null,null,null,388,{"$error":"#REF!"},{"$error":"#REF!"},null,null,null,null,null,null,null,null,null,null,null,null,null,null,null,null,null,null,null,44.875]
[45,730,45,606.44600000000003,null,389,48.5,730,null,null,null,null,null,null,null,null,null,389,{"$error":"#REF!"},{"$error":"#REF!"},null,null,null,null,null,null,null,null,null,null,null,null,null,null,null,null,null,null,null,45]
[45.125,730,45.125,593.81899999999996,null,390,48.625,731,null,null,null,null,null,null,null,null,null,390,{"$error":"#REF!"},{"$error":"#REF!"},null,null,null,null,null,null,null,null,null,null,null,null,null,null,null,null,null,null,null,45.125]
[45.25,729,45.25,585.75199999999995,null,391,48.75,731,null,null,null,null,null,null,null,null,null,391,{"$error":"#REF!"},{"$error":"#REF!"},null,null,null,null,null,null,null,null,null,null,null,null,null,null,null,null,null,null,null,45.25]
[45.375,730,45.375,577.68499999999995,null,392,48.875,730,null,null,null,null,null,null,null,null,null,392,{"$error":"#REF!"},{"$error":"#REF!"},null,null,null,null,null,null,null,null,null,null,null,null,null,null,null,null,null,null,null,45.375]
[45.5,730,45.5,569.96799999999996,null,393,49,731,null,null,null,null,null,null,null,null,null,393,{"$error":"#REF!"},{"$error":"#REF!"},null,null,null,null,null,null,null,null,null,null,null,null,null,null,null,null,null,null,null,45.5]
[45.625,731,45.625,558.04300000000001,null,394,49.125,731,null,null,null,null,null,null,null,null,null,394,{"$error":"#REF!"},{"$error":"#REF!"},null,null,null,null,null,null,null,null,null,null,null,null,null,null,null,null,null,null,null,45.625]
[45.75,731,45.75,550.32600000000002,null,395,49.25,731,null,null,null,null,null,null,null,null,null,395,{"$error":"#REF!"},{"$error":"#REF!"},null,null,null,null,null,null,null,null,null,null,null,null,null,null,null,null,null,null,null,45.75]
[45.875,731,45.875,539.10199999999998,null,396,49.375,730,null,null,null,null,null,null,null,null,null,396,{"$error":"#REF!"},{"$error":"#REF!"},null,null,null,null,null,null,null,null,null,null,null,null,null,null,null,null,null,null,null,45.875]
[46,731,46,527.52800000000002,null,397,49.5,731,null,null,null,null,null,null,null,null,null,397,{"$error":"#REF!"},{"$error":"#REF!"},null,null,null,null,null,null,null,null,null,null,null,null,null,null,null,null,null,null,null,46]
[46.125,731,46.125,513.14700000000005,null,398,49.625,731,null,null,null,null,null,null,null,null,null,398,{"$error":"#REF!"},{"$error":"#REF!"},null,null,null,null,null,null,null,null,null,null,null,null,null,null,null,null,null,null,null,46.125]
[46.25,731,46.25,506.13200000000001,null,399,49.75,730,null,null,null,null,null,null,null,null,null,399,{"$error":"#REF!"},{"$error":"#REF!"},null,null,null,null,null,null,null,null,null,null,null,null,null,null,null,null,null,null,null,46.25]
[46.375,730,46.375,495.96,null,400,49.875,730,null,null,null,null,null,null,null,null,null,400,{"$error":"#REF!"},{"$error":"#REF!"},null,null,null,null,null,null,null,null,null,null,null,null,null,null,null,null,null,null,null,46.375]
[46.5,730,46.5,486.13900000000001,null,401,50,731,null,null,null,null,null,null,null,null,null,401,{"$error":"#REF!"},{"$error":"#REF!"},null,null,null,null,null,null,null,null,null,null,null,null,null,null,null,null,null,null,null,46.5]
[46.625,731,46.625,472.46,null,402,50.125,731,null,null,null,null,null,null,null,null,null,402,{"$error":"#REF!"},{"$error":"#REF!"},null,null,null,null,null,null,null,null,null,null,null,null,null,null,null,null,null,null,null,46.625]
[46.75,731,46.75,462.99,null,403,50.25,731,null,null,null,null,null,null,null,null,null,403,{"$error":"#REF!"},{"$error":"#REF!"},null,null,null,null,null,null,null,null,null,null,null,null,null,null,null,null,null,null,null,46.75]
[46.875,730,46.875,453.16899999999998,null,404,50.375,731,null,null,null,null,null,null,null,null,null,404,{"$error":"#REF!"},{"$error":"#REF!"},null,null,null,null,null,null,null,null,null,null,null,null,null,null,null,null,null,null,null,46.875]
[47,730,47,443.69799999999998,null,405,50.5,730,null,null,null,null,null,null,null,null,null,405,{"$error":"#REF!"},{"$error":"#REF!"},null,null,null,null,null,null,null,null,null,null,null,null,null,null,null,null,null,null,null,47]
[47.125,731,47.125,437.73599999999999,null,{"$f":"F665+1","v":406},50.625,731,null,null,null,null,null,null,null,null,null,406,{"$error":"#REF!"},{"$error":"#REF!"},null,null,null,null,null,null,null,null,null,null,null,null,null,null,null,null,null,null,null,47.125]
[47.25,731,47.25,437.73599999999999,null,407,50.75,731,null,null,null,null,null,null,null,null,null,407,{"$error":"#REF!"},{"$error":"#REF!"},null,null,null,null,null,null,null,null,null,null,null,null,null,null,null,null,null,null,null,47.25]
[47.375,730,47.375,431.77300000000002,null,408,50.875,731,null,null,null,null,null,null,null,null,null,408,{"$error":"#REF!"},{"$error":"#REF!"},null,null,null,null,null,null,null,null,null,null,null,null,null,null,null,null,null,null,null,47.375]
[47.5,730,47.5,434.57900000000001,null,409,51,730,null,null,null,null,null,null,null,null,null,409,{"$error":"#REF!"},{"$error":"#REF!"},null,null,null,null,null,null,null,null,null,null,null,null,null,null,null,null,null,null,null,47.5]
[47.625,730,47.625,434.57900000000001,null,410,51.125,730,null,null,null,null,null,null,null,null,null,410,{"$error":"#REF!"},{"$error":"#REF!"},null,null,null,null,null,null,null,null,null,null,null,null,null,null,null,null,null,null,null,47.625]
[47.75,730,47.75,437.73599999999999,null,411,51.25,731,null,null,null,null,null,null,null,null,null,411,{"$error":"#REF!"},{"$error":"#REF!"},null,null,null,null,null,null,null,null,null,null,null,null,null,null,null,null,null,null,null,47.75]
[47.875,730,47.875,440.54199999999997,null,412,51.375,730,null,null,null,null,null,null,null,null,null,412,{"$error":"#REF!"},{"$error":"#REF!"},null,null,null,null,null,null,null,null,null,null,null,null,null,null,null,null,null,null,null,47.875]
[48,730,48,446.85500000000002,null,413,51.5,730,null,null,null,null,null,null,null,null,null,413,{"$error":"#REF!"},{"$error":"#REF!"},null,null,null,null,null,null,null,null,null,null,null,null,null,null,null,null,null,null,null,48]
[48.125,731,48.125,449.661,null,414,51.625,731,null,null,null,null,null,null,null,null,null,414,{"$error":"#REF!"},{"$error":"#REF!"},null,null,null,null,null,null,null,null,null,null,null,null,null,null,null,null,null,null,null,48.125]
[48.25,731,48.25,459.13099999999997,null,415,51.75,731,null,null,null,null,null,null,null,null,null,415,{"$error":"#REF!"},{"$error":"#REF!"},null,null,null,null,null,null,null,null,null,null,null,null,null,null,null,null,null,null,null,48.25]
[48.375,731,48.375,462.99,null,416,51.875,731,null,null,null,null,null,null,null,null,null,416,{"$error":"#REF!"},{"$error":"#REF!"},null,null,null,null,null,null,null,null,null,null,null,null,null,null,null,null,null,null,null,48.375]
[48.5,730,48.5,472.46,null,417,52,731,null,null,null,null,null,null,null,null,null,417,{"$error":"#REF!"},{"$error":"#REF!"},null,null,null,null,null,null,null,null,null,null,null,null,null,null,null,null,null,null,null,48.5]
[48.625,731,48.625,482.28100000000001,null,418,52.125,731,null,null,null,null,null,null,null,null,null,418,{"$error":"#REF!"},{"$error":"#REF!"},null,null,null,null,null,null,null,null,null,null,null,null,null,null,null,null,null,null,null,48.625]
[48.75,731,48.75,492.45299999999997,null,419,52.25,730,null,null,null,null,null,null,null,null,null,419,{"$error":"#REF!"},{"$error":"#REF!"},null,null,null,null,null,null,null,null,null,null,null,null,null,null,null,null,null,null,null,48.75]
[48.875,730,48.875,499.11700000000002,null,420,52.375,730,null,null,null,null,null,null,null,null,null,420,{"$error":"#REF!"},{"$error":"#REF!"},null,null,null,null,null,null,null,null,null,null,null,null,null,null,null,null,null,null,null,48.875]
[49,731,49,509.63900000000001,null,421,52.5,730,null,null,null,null,null,null,null,null,null,421,{"$error":"#REF!"},{"$error":"#REF!"},null,null,null,null,null,null,null,null,null,null,null,null,null,null,null,null,null,null,null,49]
[49.125,731,49.125,520.51300000000003,null,422,52.625,731,null,null,null,null,null,null,null,null,null,422,{"$error":"#REF!"},{"$error":"#REF!"},null,null,null,null,null,null,null,null,null,null,null,null,null,null,null,null,null,null,null,49.125]
[49.25,731,49.25,535.24400000000003,null,423,52.75,731,null,null,null,null,null,null,null,null,null,423,{"$error":"#REF!"},{"$error":"#REF!"},null,null,null,null,null,null,null,null,null,null,null,null,null,null,null,null,null,null,null,49.25]
[49.375,730,49.375,542.61,null,424,52.875,731,null,null,null,null,null,null,null,null,null,424,{"$error":"#REF!"},{"$error":"#REF!"},null,null,null,null,null,null,null,null,null,null,null,null,null,null,null,null,null,null,null,49.375]
[49.5,731,49.5,558.04300000000001,null,425,53,730,null,null,null,null,null,null,null,null,null,425,{"$error":"#REF!"},{"$error":"#REF!"},null,null,null,null,null,null,null,null,null,null,null,null,null,null,null,null,null,null,null,49.5]
[49.625,731,49.625,569.96799999999996,null,426,53.125,730,null,null,null,null,null,null,null,null,null,426,{"$error":"#REF!"},{"$error":"#REF!"},null,null,null,null,null,null,null,null,null,null,null,null,null,null,null,null,null,null,null,49.625]
[49.75,730,49.75,577.68499999999995,null,427,53.25,731,null,null,null,null,null,null,null,null,null,427,{"$error":"#REF!"},{"$error":"#REF!"},null,null,null,null,null,null,null,null,null,null,null,null,null,null,null,null,null,null,null,49.75]
[49.875,730,49.875,589.61,null,428,53.375,730,null,null,null,null,null,null,null,null,null,428,{"$error":"#REF!"},{"$error":"#REF!"},null,null,null,null,null,null,null,null,null,null,null,null,null,null,null,null,null,null,null,49.875]
[50,731,50,602.23699999999997,null,429,53.5,730,null,null,null,null,null,null,null,null,null,429,{"$error":"#REF!"},{"$error":"#REF!"},null,null,null,null,null,null,null,null,null,null,null,null,null,null,null,null,null,null,null,50]
[50.125,731,50.125,614.86400000000003,null,430,53.625,730,null,null,null,null,null,null,null,null,null,430,{"$error":"#REF!"},{"$error":"#REF!"},null,null,null,null,null,null,null,null,null,null,null,null,null,null,null,null,null,null,null,50.125]
[50.25,731,50.25,623.28200000000004,null,431,53.75,730,null,null,null,null,null,null,null,null,null,431,{"$error":"#REF!"},{"$error":"#REF!"},null,null,null,null,null,null,null,null,null,null,null,null,null,null,null,null,null,null,null,50.25]
[50.375,731,50.375,636.26,null,432,53.875,731,null,null,null,null,null,null,null,null,null,432,{"$error":"#REF!"},{"$error":"#REF!"},null,null,null,null,null,null,null,null,null,null,null,null,null,null,null,null,null,null,null,50.375]
[50.5,730,50.5,645.38,null,433,54,730,null,null,null,null,null,null,null,null,null,433,{"$error":"#REF!"},{"$error":"#REF!"},null,null,null,null,null,null,null,null,null,null,null,null,null,null,null,null,null,null,null,50.5]
[50.625,731,50.625,654.49900000000002,null,434,54.125,730,null,null,null,null,null,null,null,null,null,434,{"$error":"#REF!"},{"$error":"#REF!"},null,null,null,null,null,null,null,null,null,null,null,null,null,null,null,null,null,null,null,50.625]
[50.75,731,50.75,663.61900000000003,null,435,54.25,730,null,null,null,null,null,null,null,null,null,435,{"$error":"#REF!"},{"$error":"#REF!"},null,null,null,null,null,null,null,null,null,null,null,null,null,null,null,null,null,null,null,50.75]
[50.875,731,50.875,677.298,null,436,54.375,731,null,null,null,null,null,null,null,null,null,436,{"$error":"#REF!"},{"$error":"#REF!"},null,null,null,null,null,null,null,null,null,null,null,null,null,null,null,null,null,null,null,50.875]
[51,730,51,681.85799999999995,null,437,54.5,730,null,null,null,null,null,null,null,null,null,437,{"$error":"#REF!"},{"$error":"#REF!"},null,null,null,null,null,null,null,null,null,null,null,null,null,null,null,null,null,null,null,51]
[51.125,730,51.125,691.67899999999997,null,438,54.625,731,null,null,null,null,null,null,null,null,null,438,{"$error":"#REF!"},{"$error":"#REF!"},null,null,null,null,null,null,null,null,null,null,null,null,null,null,null,null,null,null,null,51.125]
[51.25,731,51.25,696.23800000000006,null,439,54.75,730,null,null,null,null,null,null,null,null,null,439,{"$error":"#REF!"},{"$error":"#REF!"},null,null,null,null,null,null,null,null,null,null,null,null,null,null,null,null,null,null,null,51.25]
[51.375,730,51.375,711.32100000000003,null,440,54.875,730,null,null,null,null,null,null,null,null,null,440,{"$error":"#REF!"},{"$error":"#REF!"},null,null,null,null,null,null,null,null,null,null,null,null,null,null,null,null,null,null,null,51.375]
[51.5,730,51.5,716.23099999999999,null,441,55,731,null,null,null,null,null,null,null,null,null,441,{"$error":"#REF!"},{"$error":"#REF!"},null,null,null,null,null,null,null,null,null,null,null,null,null,null,null,null,null,null,null,51.5]
[51.625,731,51.625,721.14200000000005,null,442,55.125,730,null,null,null,null,null,null,null,null,null,442,{"$error":"#REF!"},{"$error":"#REF!"},null,null,null,null,null,null,null,null,null,null,null,null,null,null,null,null,null,null,null,51.625]
[51.75,731,51.75,726.05200000000002,null,443,55.25,730,null,null,null,null,null,null,null,null,null,443,{"$error":"#REF!"},{"$error":"#REF!"},null,null,null,null,null,null,null,null,null,null,null,null,null,null,null,null,null,null,null,51.75]
[51.875,731,51.875,736.57500000000005,null,444,55.375,731,null,null,null,null,null,null,null,null,null,444,{"$error":"#REF!"},{"$error":"#REF!"},null,null,null,null,null,null,null,null,null,null,null,null,null,null,null,null,null,null,null,51.875]
[52,731,52,736.57500000000005,null,445,55.5,731,null,null,null,null,null,null,null,null,null,445,{"$error":"#REF!"},{"$error":"#REF!"},null,null,null,null,null,null,null,null,null,null,null,null,null,null,null,null,null,null,null,52]
[52.125,731,52.125,741.48500000000001,null,446,55.625,731,null,null,null,null,null,null,null,null,null,446,{"$error":"#REF!"},{"$error":"#REF!"},null,null,null,null,null,null,null,null,null,null,null,null,null,null,null,null,null,null,null,52.125]
[52.25,730,52.25,746.39599999999996,null,447,55.75,730,null,null,null,null,null,null,null,null,null,447,{"$error":"#REF!"},{"$error":"#REF!"},null,null,null,null,null,null,null,null,null,null,null,null,null,null,null,null,null,null,null,52.25]
[52.375,730,52.375,752.00800000000004,null,448,55.875,731,null,null,null,null,null,null,null,null,null,448,{"$error":"#REF!"},{"$error":"#REF!"},null,null,null,null,null,null,null,null,null,null,null,null,null,null,null,null,null,null,null,52.375]
[52.5,730,52.5,746.39599999999996,null,449,56,730,null,null,null,null,null,null,null,null,null,449,{"$error":"#REF!"},{"$error":"#REF!"},null,null,null,null,null,null,null,null,null,null,null,null,null,null,null,null,null,null,null,52.5]
[52.625,731,52.625,746.39599999999996,null,450,{"$f":"INDEX($A$200:$A$1200,MATCH(\"t in*\",$A$200:$A$1200,0)+F710)","v":56.125},{"$f":"INDEX($B$200:$B$1200,MATCH(\"t in*\",$A$200:$A$1200,0)+F710)","v":730},null,null,null,null,null,null,null,null,null,450,{"$f":"INDEX($C$1:$C$500,MATCH(\"t in*\",$C$1:$C$500,0)+R707)","v":{"$error":"#REF!"}},{"$error":"#REF!"},null,null,null,null,null,null,null,null,null,null,null,null,null,null,null,null,null,null,null,52.625]
[52.75,731,52.75,746.39599999999996,null,451,56.25,730,null,null,null,null,null,null,null,null,null,{"$f":"R710+1","v":451},{"$error":"#REF!"},{"$f":"INDEX($D$1:$D$500,MATCH(\"t in*\",$C$1:$C$500,0)+R708)","v":{"$error":"#REF!"}},null,null,null,null,null,null,null,null,null,null,null,null,null,null,null,null,null,null,null,52.75]
[52.875,731,52.875,746.39599999999996,null,452,56.375,731,null,null,null,null,null,null,null,null,null,452,{"$error":"#REF!"},{"$error":"#REF!"},null,null,null,null,null,null,null,null,null,null,null,null,null,null,null,null,null,null,null,52.875]
[53,730,53,741.48500000000001,null,453,56.5,730,null,null,null,null,null,null,null,null,null,453,{"$error":"#REF!"},{"$error":"#REF!"},null,null,null,null,null,null,null,null,null,null,null,null,null,null,null,null,null,null,null,53]
[53.125,730,53.125,736.57500000000005,null,454,56.625,731,null,null,null,null,null,null,null,null,null,454,{"$error":"#REF!"},{"$error":"#REF!"},null,null,null,null,null,null,null,null,null,null,null,null,null,null,null,null,null,null,null,53.125]
[53.25,731,53.25,730.96299999999997,null,455,56.75,731,null,null,null,null,null,null,null,null,null,455,{"$error":"#REF!"},{"$error":"#REF!"},null,null,null,null,null,null,null,null,null,null,null,null,null,null,null,null,null,null,null,53.25]
[53.375,730,53.375,726.05200000000002,null,456,56.875,731,null,null,null,null,null,null,null,null,null,456,{"$error":"#REF!"},{"$error":"#REF!"},null,null,null,null,null,null,null,null,null,null,null,null,null,null,null,null,null,null,null,53.375]
[53.5,730,53.5,721.14200000000005,null,457,57,731,null,null,null,null,null,null,null,null,null,457,{"$error":"#REF!"},{"$error":"#REF!"},null,null,null,null,null,null,null,null,null,null,null,null,null,null,null,null,null,null,null,53.5]
[53.625,730,53.625,711.32100000000003,null,458,57.125,731,null,null,null,null,null,null,null,null,null,458,{"$error":"#REF!"},{"$error":"#REF!"},null,null,null,null,null,null,null,null,null,null,null,null,null,null,null,null,null,null,null,53.625]
[53.75,730,53.75,701.5,null,459,57.25,730,null,null,null,null,null,null,null,null,null,459,{"$error":"#REF!"},{"$error":"#REF!"},null,null,null,null,null,null,null,null,null,null,null,null,null,null,null,null,null,null,null,53.75]
[53.875,731,53.875,691.67899999999997,null,460,57.375,730,null,null,null,null,null,null,null,null,null,460,{"$error":"#REF!"},{"$error":"#REF!"},null,null,null,null,null,null,null,null,null,null,null,null,null,null,null,null,null,null,null,53.875]
[54,730,54,681.85799999999995,null,461,57.5,730,null,null,null,null,null,null,null,null,null,461,{"$error":"#REF!"},{"$error":"#REF!"},null,null,null,null,null,null,null,null,null,null,null,null,null,null,null,null,null,null,null,54]
[54.125,730,54.125,672.73800000000006,null,462,57.625,730,null,null,null,null,null,null,null,null,null,462,{"$error":"#REF!"},{"$error":"#REF!"},null,null,null,null,null,null,null,null,null,null,null,null,null,null,null,null,null,null,null,54.125]
[54.25,730,54.25,663.61900000000003,null,463,57.75,730,null,null,null,null,null,null,null,null,null,463,{"$error":"#REF!"},{"$error":"#REF!"},null,null,null,null,null,null,null,null,null,null,null,null,null,null,null,null,null,null,null,54.25]
[54.375,731,54.375,649.58900000000006,null,464,57.875,731,null,null,null,null,null,null,null,null,null,464,{"$error":"#REF!"},{"$error":"#REF!"},null,null,null,null,null,null,null,null,null,null,null,null,null,null,null,null,null,null,null,54.375]
[54.5,730,54.5,641.17100000000005,null,465,58,730,null,null,null,null,null,null,null,null,null,465,{"$error":"#REF!"},{"$error":"#REF!"},null,null,null,null,null,null,null,null,null,null,null,null,null,null,null,null,null,null,null,54.5]
[54.625,731,54.625,627.49099999999999,null,466,58.125,730,null,null,null,null,null,null,null,null,null,466,{"$error":"#REF!"},{"$error":"#REF!"},null,null,null,null,null,null,null,null,null,null,null,null,null,null,null,null,null,null,null,54.625]
[54.75,730,54.75,623.28200000000004,null,467,58.25,731,null,null,null,null,null,null,null,null,null,467,{"$error":"#REF!"},{"$error":"#REF!"},null,null,null,null,null,null,null,null,null,null,null,null,null,null,null,null,null,null,null,54.75]
[54.875,730,54.875,610.65499999999997,null,468,58.375,731,null,null,null,null,null,null,null,null,null,468,{"$error":"#REF!"},{"$error":"#REF!"},null,null,null,null,null,null,null,null,null,null,null,null,null,null,null,null,null,null,null,54.875]
[55,731,55,602.23699999999997,null,469,58.5,730,null,null,null,null,null,null,null,null,null,469,{"$error":"#REF!"},{"$error":"#REF!"},null,null,null,null,null,null,null,null,null,null,null,null,null,null,null,null,null,null,null,55]
[55.125,730,55.125,593.81899999999996,null,{"$f":"F729+1","v":470},58.625,730,null,null,null,null,null,null,null,null,null,470,{"$error":"#REF!"},{"$error":"#REF!"},null,null,null,null,null,null,null,null,null,null,null,null,null,null,null,null,null,null,null,55.125]
[55.25,730,55.25,589.61,null,471,58.75,731,null,null,null,null,null,null,null,null,null,471,{"$error":"#REF!"},{"$error":"#REF!"},null,null,null,null,null,null,null,null,null,null,null,null,null,null,null,null,null,null,null,55.25]
[55.375,731,55.375,577.68499999999995,null,472,58.875,731,null,null,null,null,null,null,null,null,null,472,{"$error":"#REF!"},{"$error":"#REF!"},null,null,null,null,null,null,null,null,null,null,null,null,null,null,null,null,null,null,null,55.375]
[55.5,731,55.5,569.96799999999996,null,473,59,731,null,null,null,null,null,null,null,null,null,473,{"$error":"#REF!"},{"$error":"#REF!"},null,null,null,null,null,null,null,null,null,null,null,null,null,null,null,null,null,null,null,55.5]
[55.625,731,55.625,558.04300000000001,null,474,59.125,731,null,null,null,null,null,null,null,null,null,474,{"$error":"#REF!"},{"$error":"#REF!"},null,null,null,null,null,null,null,null,null,null,null,null,null,null,null,null,null,null,null,55.625]
[55.75,730,55.75,553.83399999999995,null,475,59.25,731,null,null,null,null,null,null,null,null,null,475,{"$error":"#REF!"},{"$error":"#REF!"},null,null,null,null,null,null,null,null,null,null,null,null,null,null,null,null,null,null,null,55.75]
[55.875,731,55.875,539.10199999999998,null,476,59.375,729,null,null,null,null,null,null,null,null,null,476,{"$error":"#REF!"},{"$error":"#REF!"},null,null,null,null,null,null,null,null,null,null,null,null,null,null,null,null,null,null,null,55.875]
[56,730,56,531.73699999999997,null,477,59.5,731,null,null,null,null,null,null,null,null,null,477,{"$error":"#REF!"},{"$error":"#REF!"},null,null,null,null,null,null,null,null,null,null,null,null,null,null,null,null,null,null,null,56]
[56.125,730,56.125,520.51300000000003,null,478,59.625,731,null,null,null,null,null,null,null,null,null,478,{"$error":"#REF!"},{"$error":"#REF!"},null,null,null,null,null,null,null,null,null,null,null,null,null,null,null,null,null,null,null,56.125]
[56.25,730,56.25,509.63900000000001,null,479,59.75,731,null,null,null,null,null,null,null,null,null,479,{"$error":"#REF!"},{"$error":"#REF!"},null,null,null,null,null,null,null,null,null,null,null,null,null,null,null,null,null,null,null,56.25]
[56.375,731,56.375,495.96,null,480,59.875,731,null,null,null,null,null,null,null,null,null,480,{"$error":"#REF!"},{"$error":"#REF!"},null,null,null,null,null,null,null,null,null,null,null,null,null,null,null,null,null,null,null,56.375]
[56.5,730,56.5,486.13900000000001,null,481,60,730,null,null,null,null,null,null,null,null,null,481,{"$error":"#REF!"},{"$error":"#REF!"},null,null,null,null,null,null,null,null,null,null,null,null,null,null,null,null,null,null,null,56.5]
[56.625,731,56.625,475.61700000000002,null,482,60.125,731,null,null,null,null,null,null,null,null,null,482,{"$error":"#REF!"},{"$error":"#REF!"},null,null,null,null,null,null,null,null,null,null,null,null,null,null,null,null,null,null,null,56.625]
[56.75,731,56.75,466.14600000000002,null,483,60.25,731,null,null,null,null,null,null,null,null,null,483,{"$error":"#REF!"},{"$error":"#REF!"},null,null,null,null,null,null,null,null,null,null,null,null,null,null,null,null,null,null,null,56.75]
[56.875,731,56.875,456.32499999999999,null,484,60.375,730,null,null,null,null,null,null,null,null,null,484,{"$error":"#REF!"},{"$error":"#REF!"},null,null,null,null,null,null,null,null,null,null,null,null,null,null,null,null,null,null,null,56.875]
[57,731,57,446.85500000000002,null,485,60.5,731,null,null,null,null,null,null,null,null,null,485,{"$error":"#REF!"},{"$error":"#REF!"},null,null,null,null,null,null,null,null,null,null,null,null,null,null,null,null,null,null,null,57]
[57.125,731,57.125,440.54199999999997,null,486,60.625,731,null,null,null,null,null,null,null,null,null,486,{"$error":"#REF!"},{"$error":"#REF!"},null,null,null,null,null,null,null,null,null,null,null,null,null,null,null,null,null,null,null,57.125]
[57.25,730,57.25,440.54199999999997,null,487,60.75,730,null,null,null,null,null,null,null,null,null,487,{"$error":"#REF!"},{"$error":"#REF!"},null,null,null,null,null,null,null,null,null,null,null,null,null,null,null,null,null,null,null,57.25]
[57.375,730,57.375,437.73599999999999,null,488,60.875,731,null,null,null,null,null,null,null,null,null,488,{"$error":"#REF!"},{"$error":"#REF!"},null,null,null,null,null,null,null,null,null,null,null,null,null,null,null,null,null,null,null,57.375]
[57.5,730,57.5,437.73599999999999,null,489,61,730,null,null,null,null,null,null,null,null,null,489,{"$error":"#REF!"},{"$error":"#REF!"},null,null,null,null,null,null,null,null,null,null,null,null,null,null,null,null,null,null,null,57.5]
[57.625,730,57.625,437.73599999999999,null,490,61.125,731,null,null,null,null,null,null,null,null,null,490,{"$error":"#REF!"},{"$error":"#REF!"},null,null,null,null,null,null,null,null,null,null,null,null,null,null,null,null,null,null,null,57.625]
[57.75,730,57.75,440.54199999999997,null,491,61.25,730,null,null,null,null,null,null,null,null,null,491,{"$error":"#REF!"},{"$error":"#REF!"},null,null,null,null,null,null,null,null,null,null,null,null,null,null,null,null,null,null,null,57.75]
[57.875,731,57.875,446.85500000000002,null,492,61.375,731,null,null,null,null,null,null,null,null,null,492,{"$error":"#REF!"},{"$error":"#REF!"},null,null,null,null,null,null,null,null,null,null,null,null,null,null,null,null,null,null,null,57.875]
[58,730,58,449.661,null,493,61.5,730,null,null,null,null,null,null,null,null,null,493,{"$error":"#REF!"},{"$error":"#REF!"},null,null,null,null,null,null,null,null,null,null,null,null,null,null,null,null,null,null,null,58]
[58.125,730,58.125,456.32499999999999,null,494,61.625,730,null,null,null,null,null,null,null,null,null,494,{"$error":"#REF!"},{"$error":"#REF!"},null,null,null,null,null,null,null,null,null,null,null,null,null,null,null,null,null,null,null,58.125]
[58.25,731,58.25,462.99,null,495,61.75,730,null,null,null,null,null,null,null,null,null,495,{"$error":"#REF!"},{"$error":"#REF!"},null,null,null,null,null,null,null,null,null,null,null,null,null,null,null,null,null,null,null,58.25]
[58.375,731,58.375,472.46,null,496,61.875,730,null,null,null,null,null,null,null,null,null,496,{"$error":"#REF!"},{"$error":"#REF!"},null,null,null,null,null,null,null,null,null,null,null,null,null,null,null,null,null,null,null,58.375]
[58.5,730,58.5,479.12400000000002,null,497,62,731,null,null,null,null,null,null,null,null,null,497,{"$error":"#REF!"},{"$error":"#REF!"},null,null,null,null,null,null,null,null,null,null,null,null,null,null,null,null,null,null,null,58.5]
[58.625,730,58.625,489.29599999999999,null,498,62.125,731,null,null,null,null,null,null,null,null,null,498,{"$error":"#REF!"},{"$error":"#REF!"},null,null,null,null,null,null,null,null,null,null,null,null,null,null,null,null,null,null,null,58.625]
[58.75,731,58.75,495.96,null,499,62.25,730,null,null,null,null,null,null,null,null,null,499,{"$error":"#REF!"},{"$error":"#REF!"},null,null,null,null,null,null,null,null,null,null,null,null,null,null,null,null,null,null,null,58.75]
[58.875,731,58.875,506.13200000000001,null,500,62.375,730,null,null,null,null,null,null,null,null,null,500,{"$error":"#REF!"},{"$error":"#REF!"},null,null,null,null,null,null,null,null,null,null,null,null,null,null,null,null,null,null,null,58.875]
[59,731,59,516.654,null,501,62.5,730,null,null,null,null,null,null,null,null,null,501,{"$error":"#REF!"},{"$error":"#REF!"},null,null,null,null,null,null,null,null,null,null,null,null,null,null,null,null,null,null,null,59]
[59.125,731,59.125,527.52800000000002,null,502,62.625,731,null,null,null,null,null,null,null,null,null,502,{"$error":"#REF!"},{"$error":"#REF!"},null,null,null,null,null,null,null,null,null,null,null,null,null,null,null,null,null,null,null,59.125]
[59.25,731,59.25,539.10199999999998,null,503,62.75,730,null,null,null,null,null,null,null,null,null,503,{"$error":"#REF!"},{"$error":"#REF!"},null,null,null,null,null,null,null,null,null,null,null,null,null,null,null,null,null,null,null,59.25]
[59.375,729,59.375,553.83399999999995,null,504,62.875,731,null,null,null,null,null,null,null,null,null,504,{"$error":"#REF!"},{"$error":"#REF!"},null,null,null,null,null,null,null,null,null,null,null,null,null,null,null,null,null,null,null,59.375]
[59.5,731,59.5,561.90099999999995,null,505,63,730,null,null,null,null,null,null,null,null,null,505,{"$error":"#REF!"},{"$error":"#REF!"},null,null,null,null,null,null,null,null,null,null,null,null,null,null,null,null,null,null,null,59.5]
[59.625,731,59.625,577.68499999999995,null,506,63.125,731,null,null,null,null,null,null,null,null,null,506,{"$error":"#REF!"},{"$error":"#REF!"},null,null,null,null,null,null,null,null,null,null,null,null,null,null,null,null,null,null,null,59.625]
[59.75,731,59.75,585.75199999999995,null,507,63.25,730,null,null,null,null,null,null,null,null,null,507,{"$error":"#REF!"},{"$error":"#REF!"},null,null,null,null,null,null,null,null,null,null,null,null,null,null,null,null,null,null,null,59.75]
[59.875,731,59.875,598.37900000000002,null,508,63.375,730,null,null,null,null,null,null,null,null,null,508,{"$error":"#REF!"},{"$error":"#REF!"},null,null,null,null,null,null,null,null,null,null,null,null,null,null,null,null,null,null,null,59.875]
[60,730,60,606.44600000000003,null,509,63.5,730,null,null,null,null,null,null,null,null,null,509,{"$error":"#REF!"},{"$error":"#REF!"},null,null,null,null,null,null,null,null,null,null,null,null,null,null,null,null,null,null,null,60]
[60.125,731,60.125,623.28200000000004,null,510,63.625,731,null,null,null,null,null,null,null,null,null,510,{"$error":"#REF!"},{"$error":"#REF!"},null,null,null,null,null,null,null,null,null,null,null,null,null,null,null,null,null,null,null,60.125]
[60.25,731,60.25,631.70000000000005,null,511,63.75,730,null,null,null,null,null,null,null,null,null,511,{"$error":"#REF!"},{"$error":"#REF!"},null,null,null,null,null,null,null,null,null,null,null,null,null,null,null,null,null,null,null,60.25]
[60.375,730,60.375,641.17100000000005,null,512,63.875,731,null,null,null,null,null,null,null,null,null,512,{"$error":"#REF!"},{"$error":"#REF!"},null,null,null,null,null,null,null,null,null,null,null,null,null,null,null,null,null,null,null,60.375]
[60.5,731,60.5,649.58900000000006,null,null,null,null,null,null,null,null,null,null,null,null,null,null,null,null,null,null,null,null,null,null,null,null,null,null,null,null,null,null,null,null,null,null,null,60.5]
[60.625,731,60.625,663.61900000000003,null,null,null,null,null,null,null,null,null,null,null,null,null,null,null,null,null,null,null,null,null,null,null,null,null,null,null,null,null,null,null,null,null,null,null,60.625]
[60.75,730,60.75,672.73800000000006,null,null,null,null,null,null,null,null,null,null,null,null,null,null,null,null,null,null,null,null,null,null,null,null,null,null,null,null,null,null,null,null,null,null,null,60.75]
[60.875,731,60.875,681.85799999999995,null,null,null,null,null,null,null,null,null,null,null,null,null,null,null,null,null,null,null,null,null,null,null,null,null,null,null,null,null,null,null,null,null,null,null,60.875]
[61,730,61,691.67899999999997,null,null,null,null,null,null,null,null,null,null,null,null,null,null,null,null,null,null,null,null,null,null,null,null,null,null,null,null,null,null,null,null,null,null,null,61]
[61.125,731,61.125,701.5,null,null,null,null,null,null,null,null,null,null,null,null,null,null,null,null,null,null,null,null,null,null,null,null,null,null,null,null,null,null,null,null,null,null,null,61.125]
[61.25,730,61.25,706.41,null,null,null,null,null,null,null,null,null,null,null,null,null,null,null,null,null,null,null,null,null,null,null,null,null,null,null,null,null,null,null,null,null,null,null,61.25]
[61.375,731,61.375,711.32100000000003,null,null,null,null,null,null,null,null,null,null,null,null,null,null,null,null,null,null,null,null,null,null,null,null,null,null,null,null,null,null,null,null,null,null,null,61.375]
[61.5,730,61.5,721.14200000000005,null,null,null,null,null,null,null,null,null,null,null,null,null,null,null,null,null,null,null,null,null,null,null,null,null,null,null,null,null,null,null,null,null,null,null,61.5]
[61.625,730,61.625,730.96299999999997,null,null,null,null,null,null,null,null,null,null,null,null,null,null,null,null,null,null,null,null,null,null,null,null,null,null,null,null,null,null,null,null,null,null,null,61.625]
[61.75,730,61.75,736.57500000000005,null,null,null,null,null,null,null,null,null,null,null,null,null,null,null,null,null,null,null,null,null,null,null,null,null,null,null,null,null,null,null,null,null,null,null,61.75]
[61.875,730,61.875,741.48500000000001,null,null,null,null,null,null,null,null,null,null,null,null,null,null,null,null,null,null,null,null,null,null,null,null,null,null,null,null,null,null,null,null,null,null,null,61.875]
[62,731,62,746.39599999999996,null,null,null,null,null,null,null,null,null,null,null,null,null,null,null,null,null,null,null,null,null,null,null,null,null,null,null,null,null,null,null,null,null,null,null,62]
[62.125,731,62.125,752.00800000000004,null,null,null,null,null,null,null,null,null,null,null,null,null,null,null,null,null,null,null,null,null,null,null,null,null,null,null,null,null,null,null,null,null,null,null,62.125]
[62.25,730,62.25,752.00800000000004,null,null,null,null,null,null,null,null,null,null,null,null,null,null,null,null,null,null,null,null,null,null,null,null,null,null,null,null,null,null,null,null,null,null,null,62.25]
[62.375,730,62.375,756.91800000000001,null,null,null,null,null,null,null,null,null,null,null,null,null,null,null,null,null,null,null,null,null,null,null,null,null,null,null,null,null,null,null,null,null,null,null,62.375]
[62.5,730,62.5,762.53,null,null,null,null,null,null,null,null,null,null,null,null,null,null,null,null,null,null,null,null,null,null,null,null,null,null,null,null,null,null,null,null,null,null,null,62.5]
[62.625,731,62.625,756.91800000000001,null,null,null,null,null,null,null,null,null,null,null,null,null,null,null,null,null,null,null,null,null,null,null,null,null,null,null,null,null,null,null,null,null,null,null,62.625]
[62.75,730,62.75,756.91800000000001,null,null,null,null,null,null,null,null,null,null,null,null,null,null,null,null,null,null,null,null,null,null,null,null,null,null,null,null,null,null,null,null,null,null,null,62.75]
[62.875,731,62.875,752.00800000000004,null,null,null,null,null,null,null,null,null,null,null,null,null,null,null,null,null,null,null,null,null,null,null,null,null,null,null,null,null,null,null,null,null,null,null,62.875]
[63,730,63,752.00800000000004,null,null,null,null,null,null,null,null,null,null,null,null,null,null,null,null,null,null,null,null,null,null,null,null,null,null,null,null,null,null,null,null,null,null,null,63]
[63.125,731,63.125,746.39599999999996,null,null,null,null,null,null,null,null,null,null,null,null,null,null,null,null,null,null,null,null,null,null,null,null,null,null,null,null,null,null,null,null,null,null,null,63.125]
[63.25,730,63.25,741.48500000000001,null,null,null,null,null,null,null,null,null,null,null,null,null,null,null,null,null,null,null,null,null,null,null,null,null,null,null,null,null,null,null,null,null,null,null,63.25]
[63.375,730,63.375,730.96299999999997,null,null,null,null,null,null,null,null,null,null,null,null,null,null,null,null,null,null,null,null,null,null,null,null,null,null,null,null,null,null,null,null,null,null,null,63.375]
[63.5,730,63.5,726.05200000000002,null,null,null,null,null,null,null,null,null,null,null,null,null,null,null,null,null,null,null,null,null,null,null,null,null,null,null,null,null,null,null,null,null,null,null,63.5]
[63.625,731,63.625,716.23099999999999,null,null,null,null,null,null,null,null,null,null,null,null,null,null,null,null,null,null,null,null,null,null,null,null,null,null,null,null,null,null,null,null,null,null,null,63.625]
[63.75,730,63.75,706.41,null,null,null,null,null,null,null,null,null,null,null,null,null,null,null,null,null,null,null,null,null,null,null,null,null,null,null,null,null,null,null,null,null,null,null,63.75]
[63.875,731,63.875,696.23800000000006,null,null,null,null,null,null,null,null,null,null,null,null,null,null,null,null,null,null,null,null,null,null,null,null,null,null,null,null,null,null,null,null,null,null,null,63.875]

{"sheet":"Version 2.3 Base","index":8,"n_rows":0,"n_cols":0,"rows_kept":0,"cut":false,"hidden":false,"merged":[]}