{"text_format":"1","workbook":"xlsx","n_sheets":7,"sheets":["Protokoll 1 (5nm)","Protokoll 2 (native)","Protokoll 3","Protokoll TM30","Referenzvergleich","Data","Version 1.7"],"not_rendered":{"charts":14,"images":11,"macros":1,"external_links":0,"defined_names":5,"comments":0,"pivot_tables":0},"unopened":[],"bounds":{"document_bytes":16777216,"sheet_cells":100000,"rows_first":2000,"rows_last":500,"rows_between":2000,"halvings":0,"cell_chars":16384,"cell_head_chars":4096},"cells_cut":0,"cells_raw":0,"read":"whole","date_system":"1900"}

{"sheet":"Protokoll 1 (5nm)","index":0,"n_rows":58,"n_cols":94,"rows_kept":58,"cut":false,"hidden":false,"merged":[[3,84,3,99],[22,34,22,64],[23,34,23,64],[24,34,24,64],[26,34,26,64],[27,34,27,64],[29,34,29,64],[31,34,31,64],[32,34,32,64],[30,86,30,98],[26,86,26,98],[22,86,22,98],[23,86,23,88],[24,86,24,88],[4,13,4,58],[5,13,5,58],[22,10,22,15],[23,10,23,15],[24,10,24,15],[32,89,32,90],[27,89,27,90],[28,89,28,90],[31,89,31,90],[27,65,27,81],[22,3,22,7],[44,50,44,57],[45,44,45,49],[34,65,34,81],[28,3,28,7],[57,0,57,14],[34,3,34,7],[34,8,34,9],[34,10,34,15],[35,3,35,7],[35,8,35,9],[35,10,35,15],[22,8,22,9],[23,8,23,9],[24,8,24,9],[25,8,25,9],[26,8,26,9],[27,8,27,9],[32,3,32,7],[32,8,32,9],[32,10,32,15],[29,3,29,7],[29,8,29,9],[29,10,29,15],[51,44,51,49],[51,50,51,57],[40,58,40,63],[40,64,40,71],[41,58,41,63],[41,64,41,71],[47,44,47,49],[47,50,47,57],[48,44,48,49],[48,50,48,57],[49,44,49,49],[49,50,49,57],[43,50,43,57],[44,44,44,49],[42,44,42,49],[42,50,42,57],[43,44,43,49],[35,34,35,64],[36,34,36,64],[34,34,34,64],[26,65,26,81],[25,10,25,15],[26,10,26,15],[27,10,27,15],[36,10,36,15],[22,65,22,81],[29,65,29,81],[22,17,22,21],[23,65,23,81],[24,65,24,81],[23,17,23,21],[23,22,23,23],[23,24,23,29],[24,17,24,21],[24,22,24,23],[24,24,24,29],[36,86,36,90],[34,86,34,98],[50,92,50,99],[51,86,51,91],[51,92,51,99],[36,65,36,81],[35,65,35,81],[31,65,31,81],[32,65,32,81],[39,72,39,77],[39,78,39,85],[40,72,40,77],[40,78,40,85],[41,72,41,77],[41,78,41,85],[42,72,42,77],[42,78,42,85],[48,72,48,77],[48,78,48,85],[41,86,41,91],[41,92,41,99],[42,86,42,91],[42,92,42,99],[43,86,43,91],[23,89,23,90],[24,89,24,90],[45,86,45,91],[45,92,45,99],[46,86,46,91],[46,92,46,99],[47,86,47,91],[47,92,47,99],[50,86,50,91],[23,91,23,98],[24,91,24,98],[27,91,27,98],[28,91,28,98],[31,91,31,98],[32,91,32,98],[35,91,35,92],[35,93,35,98],[36,91,36,92],[36,93,36,98],[35,86,35,90],[27,86,27,88],[28,86,28,88],[31,86,31,88],[32,86,32,88],[43,92,43,99],[46,72,46,77],[46,78,46,85],[47,72,47,77],[47,78,47,85],[43,72,43,77],[43,78,43,85],[44,72,44,77],[44,78,44,85],[45,72,45,77],[45,78,45,85],[39,36,39,43],[50,44,50,49],[50,50,50,57],[46,64,46,71],[47,58,47,63],[47,64,47,71],[42,58,42,63],[42,64,42,71],[43,58,43,63],[43,64,43,71],[44,58,44,63],[44,64,44,71],[45,50,45,57],[45,58,45,63],[45,64,45,71],[46,44,46,49],[46,50,46,57],[39,44,39,49],[41,44,41,49],[39,50,39,57],[40,44,40,49],[40,50,40,57],[41,50,41,57],[46,58,46,63],[31,3,31,7],[31,8,31,9],[31,10,31,15],[45,2,45,7],[40,2,40,7],[46,2,46,7],[28,8,28,9],[28,10,28,15],[44,2,44,7],[45,8,45,15],[39,2,39,7],[41,2,41,7],[36,3,36,7],[30,8,30,9],[42,2,42,7],[43,2,43,7],[30,3,30,7],[36,8,36,9],[30,10,30,15],[39,16,39,21],[39,22,39,29],[40,16,40,21],[40,22,40,29],[41,16,41,21],[41,22,41,29],[39,8,39,15],[40,8,40,15],[41,8,41,15],[39,30,39,35],[49,8,49,15],[50,8,50,15],[40,30,40,35],[40,36,40,43],[41,30,41,35],[41,36,41,43],[39,58,39,63],[39,64,39,71],[47,16,47,21],[47,22,47,29],[49,30,49,35],[49,36,49,43],[45,30,45,35],[45,36,45,43],[46,30,46,35],[46,36,46,43],[47,30,47,35],[47,36,47,43],[45,16,45,21],[45,22,45,29],[46,16,46,21],[46,22,46,29],[48,16,48,21],[50,2,50,7],[49,16,49,21],[49,22,49,29],[50,16,50,21],[49,2,49,7],[42,8,42,15],[43,8,43,15],[44,8,44,15],[46,8,46,15],[43,22,43,29],[44,16,44,21],[44,22,44,29],[48,22,48,29],[51,78,51,85],[33,3,33,7],[33,8,33,9],[48,8,48,15],[47,8,47,15],[51,72,51,77],[51,30,51,35],[51,8,51,15],[51,2,51,7],[51,16,51,21],[51,22,51,29],[48,2,48,7],[48,30,48,35],[48,36,48,43],[48,58,48,63],[48,64,48,71],[51,58,51,63],[51,64,51,71],[49,58,49,63],[49,64,49,71],[50,58,50,63],[50,64,50,71],[51,36,51,43],[50,22,50,29],[3,13,3,58],[50,78,50,85],[33,10,33,15],[22,22,22,23],[22,24,22,29],[26,3,26,7],[27,3,27,7],[42,30,42,35],[42,36,42,43],[43,30,43,35],[43,36,43,43],[44,30,44,35],[44,36,44,43],[42,16,42,21],[42,22,42,29],[43,16,43,21],[23,3,23,7],[24,3,24,7],[25,3,25,7],[50,30,50,35],[50,36,50,43],[47,2,47,7],[49,72,49,77],[50,72,50,77],[55,0,55,26],[54,0,54,26],[53,0,53,26],[57,63,57,83],[57,84,57,101],[0,0,1,53],[49,86,49,91],[48,86,48,91],[49,92,49,99],[48,92,48,99],[40,92,40,99],[40,86,40,91],[39,92,39,99],[39,86,39,91],[44,92,44,99],[44,86,44,91],[57,15,57,26],[49,78,49,85],[4,84,4,99],[5,84,5,99],[3,62,3,83],[5,62,5,83],[4,62,4,83],[3,0,3,12]]}
[{"$f":"IF(Data!$AE$2=\"DE\",\"Messprotokoll\",IF(Data!$AE$2=\"UK\",\"Measurement protocol\",IF(Data!$AE$2=\"FR\",\"Rapport de mesure\",\"Language Error\")))","v":"Messprotokoll"}]
[]
[]
[{"$f":"IF(Data!$AE$2 = \"DE\", \"Prüfling:\", IF(Data!$AE$2 = \"UK\",\"Test object:\",IF(Data!$AE$2=\"FR\",\"Objet testé:\",\"Language Error\")))","v":"Prüfling:"},null,null,null,null,null,null,null,null,null,null,null,null,"Philips",null,null,null,null,null,null,null,null,null,null,null,null,null,null,null,null,null,null,null,null,null,null,null,null,null,null,null,null,null,null,null,null,null,null,null,null,null,null,null,null,null,null,null,null,null,null,null,null,{"$f":"IF(Data!$AE$2=\"DE\",\"Messdatei:\",IF(Data!$AE$2=\"UK\",\"Measurement file:\",IF(Data!$AE$2=\"FR\",\"Fichier de mesure:\",\"Language Error\")))","v":"Messdatei:"},null,null,null,null,null,null,null,null,null,null,null,null,null,null,null,null,null,null,null,null,null,{"$f":"Data!Q18","v":"Test-M.CSV"}]
[null,null,null,null,null,null,null,null,null,null,null,null,null,"Master TL-D Super 80",null,null,null,null,null,null,null,null,null,null,null,null,null,null,null,null,null,null,null,null,null,null,null,null,null,null,null,null,null,null,null,null,null,null,null,null,null,null,null,null,null,null,null,null,null,null,null,null,{"$f":"IF(Data!$AE$2=\"DE\",\"Datum der Messung:\",IF(Data!$AE$2=\"UK\",\"Date of measurement:\",IF(Data!$AE$2=\"FR\",\"Date de mesure:\",\"Language Error\")))","v":"Datum der Messung:"},null,null,null,null,null,null,null,null,null,null,null,null,null,null,null,null,null,null,null,null,null,{"$f":"Data!Q23","v":"03.03.2017"}]
[null,null,null,null,null,null,null,null,null,null,null,null,null,"36W/840",null,null,null,null,null,null,null,null,null,null,null,null,null,null,null,null,null,null,null,null,null,null,null,null,null,null,null,null,null,null,null,null,null,null,null,null,null,null,null,null,null,null,null,null,null,null,null,null,{"$f":"IF(Data!$AE$2=\"DE\",\"Uhrzeit der Messung:\",IF(Data!$AE$2=\"UK\",\"Time of measurement:\",IF(Data!$AE$2=\"FR\",\"Heure de mesure:\",\"Language Error\")))","v":"Uhrzeit der Messung:"},null,null,null,null,null,null,null,null,null,null,null,null,null,null,null,null,null,null,null,null,null,{"$f":"Data!Q21","v":"08:17:53"}]
[]
[]
[]
[]
[]
[]
[]
[]
[]
[]
[]
[]
[]
[]
[]
[]
[null,null,null,"R1",null,null,null,null,"=",null,{"$f":"Data!K2","v":91.71},null,null,null,null,null,null,"Ra",null,null,null,null,"=",null,{"$f":"Data!K1","v":79.81},null,null,null,null,null,null,null,null,null,{"$f":"IF(Data!$AE$2=\"DE\",\"Beleuchtungsstärke\",IF(Data!$AE$2=\"UK\",\"Illuminance\",IF(Data!$AE$2=\"FR\",\"Illuminance\",\"Language Error\")))","v":"Beleuchtungsstärke"},null,null,null,null,null,null,null,null,null,null,null,null,null,null,null,null,null,null,null,null,null,null,null,null,null,null,null,null,null,null,{"$f":"Data!K33","v":3356.21},null,null,null,null,null,null,null,null,null,null,null,null,null,null,null,null,null,null,null,null,{"$f":"IF(CI24=\"x\",\"CIE1931\",IF(CI24=\"u'\",\"CIE1976\",IF(CI24=\"u\",\"CIE1960\",\"\")))","v":"CIE1931"}]
[null,null,null,"R2",null,null,null,null,"=",null,{"$f":"Data!K3","v":88.83},null,null,null,null,null,null,"Re",null,null,null,null,"=",null,{"$f":"Data!Q27","v":70.180000000000007},null,null,null,null,null,null,null,null,null,"Ee",null,null,null,null,null,null,null,null,null,null,null,null,null,null,null,null,null,null,null,null,null,null,null,null,null,null,null,null,null,null,{"$f":"Data!Q25","v":9.4},null,null,null,null,null,null,null,null,null,null,null,null,null,null,null,null,null,null,null,null,{"$f":"Data!J23","v":"x"},null,null,"=",null,{"$f":"Data!K23","v":0.39400000000000002}]
[null,null,null,"R3",null,null,null,null,"=",null,{"$f":"Data!K4","v":57.53},null,null,null,null,null,null,"GAI",null,null,null,null,"=",null,{"$f":"Data!Q28","v":69.14},null,null,null,null,null,null,null,null,null,"LER",null,null,null,null,null,null,null,null,null,null,null,null,null,null,null,null,null,null,null,null,null,null,null,null,null,null,null,null,null,null,{"$f":"Data!Q26","v":357},null,null,null,null,null,null,null,null,null,null,null,null,null,null,null,null,null,null,null,null,{"$f":"Data!J24","v":"y"},null,null,"=",null,{"$f":"Data!K24","v":0.39760000000000001}]
[null,null,null,"R4",null,null,null,null,"=",null,{"$f":"Data!K5","v":86.75}]
[null,null,null,"R5",null,null,null,null,"=",null,{"$f":"Data!K6","v":81.88},null,null,null,null,null,null,null,null,null,null,null,null,null,null,null,null,null,null,null,null,null,null,null,{"$f":"IF(Data!$AE$2 = \"DE\", \"Ähnlichste Farbtemperatur (CCT)\", IF(Data!$AE$2 = \"UK\",\"correlated color temperature (CCT)\",IF(Data!$AE$2=\"FR\",\"temp. de couleur proximale (CCT)\",\"Language Error\")))","v":"Ähnlichste Farbtemperatur (CCT)"},null,null,null,null,null,null,null,null,null,null,null,null,null,null,null,null,null,null,null,null,null,null,null,null,null,null,null,null,null,null,{"$f":"Data!K30","v":3809},null,null,null,null,null,null,null,null,null,null,null,null,null,null,null,null,null,null,null,null,{"$f":"IF(CI28=\"x\",\"CIE1931\",IF(CI28=\"u'\",\"CIE1976\",IF(CI28=\"u\",\"CIE1960\",\"\")))","v":"CIE1976"}]
[null,null,null,"R6",null,null,null,null,"=",null,{"$f":"Data!K7","v":75.45},null,null,null,null,null,null,null,null,null,null,null,null,null,null,null,null,null,null,null,null,null,null,null,"Duv",null,null,null,null,null,null,null,null,null,null,null,null,null,null,null,null,null,null,null,null,null,null,null,null,null,null,null,null,null,null,{"$f":"Data!K31","v":5.7000000000000002E-3},null,null,null,null,null,null,null,null,null,null,null,null,null,null,null,null,null,null,null,null,{"$f":"Data!J25","v":"u'"},null,null,"=",null,{"$f":"Data!K25","v":0.22570000000000001}]
[null,null,null,"R7",null,null,null,null,"=",null,{"$f":"Data!K8","v":88.44},null,null,null,null,null,null,null,null,null,null,null,null,null,null,null,null,null,null,null,null,null,null,null,null,null,null,null,null,null,null,null,null,null,null,null,null,null,null,null,null,null,null,null,null,null,null,null,null,null,null,null,null,null,null,null,null,null,null,null,null,null,null,null,null,null,null,null,null,null,null,null,null,null,null,null,{"$f":"Data!J26","v":"v'"},null,null,"=",null,{"$f":"Data!K26","v":0.51239999999999997}]
[null,null,null,"R8",null,null,null,null,"=",null,{"$f":"Data!K9","v":67.86},null,null,null,null,null,null,null,null,null,null,null,null,null,null,null,null,null,null,null,null,null,null,null,{"$f":"IF(Data!$AE$2 = \"DE\", \"Farbreinheit\",IF(Data!$AE$2 = \"UK\",\"Saturation\",IF(Data!$AE$2=\"FR\",\"Saturation\",\"Language Error\")))","v":"Farbreinheit"},null,null,null,null,null,null,null,null,null,null,null,null,null,null,null,null,null,null,null,null,null,null,null,null,null,null,null,null,null,null,{"$f":"Data!K39","v":37.5}]
[null,null,null,"R9",null,null,null,null,"=",null,{"$f":"Data!K10","v":-4.37},null,null,null,null,null,null,null,null,null,null,null,null,null,null,null,null,null,null,null,null,null,null,null,null,null,null,null,null,null,null,null,null,null,null,null,null,null,null,null,null,null,null,null,null,null,null,null,null,null,null,null,null,null,null,null,null,null,null,null,null,null,null,null,null,null,null,null,null,null,null,null,null,null,null,null,{"$f":"IF(CI32=\"x\",\"CIE1931\",IF(CI32=\"u'\",\"CIE1976\",IF(CI32=\"u\",\"CIE1960\",\"\")))","v":"CIE1960"}]
[null,null,null,"R10",null,null,null,null,"=",null,{"$f":"Data!K11","v":44.54},null,null,null,null,null,null,null,null,null,null,null,null,null,null,null,null,null,null,null,null,null,null,null,{"$f":"IF(Data!$AE$2 = \"DE\", \"Dominante Wellenlänge\", IF(Data!$AE$2 = \"UK\", \"Dominant wavelength\",IF(Data!$AE$2=\"FR\",\"Longueur d'onde dominante (λD)\",\"Language Error\")))","v":"Dominante Wellenlänge"},null,null,null,null,null,null,null,null,null,null,null,null,null,null,null,null,null,null,null,null,null,null,null,null,null,null,null,null,null,null,{"$f":"Data!K40 & \" nm\"","v":"577 nm"},null,null,null,null,null,null,null,null,null,null,null,null,null,null,null,null,null,null,null,null,{"$f":"Data!J27","v":"u"},null,null,"=",null,{"$f":"Data!K27","v":0.22570000000000001}]
[null,null,null,"R11",null,null,null,null,"=",null,{"$f":"Data!K12","v":71.98},null,null,null,null,null,null,null,null,null,null,null,null,null,null,null,null,null,null,null,null,null,null,null,{"$f":"IF(Data!$AE$2 = \"DE\", \"Peak-Wellenlänge\",IF(Data!$AE$2 = \"UK\", \"Peak wavelength\",IF(Data!$AE$2=\"FR\",\"Pic courbe spectrale (λP)\",\"Language Error\")))","v":"Peak-Wellenlänge"},null,null,null,null,null,null,null,null,null,null,null,null,null,null,null,null,null,null,null,null,null,null,null,null,null,null,null,null,null,null,{"$f":"Data!K20 & \" nm\"","v":"543 nm"},null,null,null,null,null,null,null,null,null,null,null,null,null,null,null,null,null,null,null,null,{"$f":"Data!J28","v":"v"},null,null,"=",null,{"$f":"Data!K28","v":0.34160000000000001}]
[null,null,null,"R12",null,null,null,null,"=",null,{"$f":"Data!K13","v":49.3}]
[null,null,null,"R13",null,null,null,null,"=",null,{"$f":"Data!K14","v":92.95},null,null,null,null,null,null,null,null,null,null,null,null,null,null,null,null,null,null,null,null,null,null,null,{"$f":"IF(Data!$AE$2 = \"DE\", \"Flickerfrequenz\", IF(Data!$AE$2 = \"UK\",\"Flicker frequency\",IF(Data!$AE$2=\"FR\",\"Fréquence flicker\",\"Language Error\")))","v":"Flickerfrequenz"},null,null,null,null,null,null,null,null,null,null,null,null,null,null,null,null,null,null,null,null,null,null,null,null,null,null,null,null,null,null,{"$f":"Data!K36","v":100},null,null,null,null,null,null,null,null,null,null,null,null,null,null,null,null,null,null,null,null,"TM30"]
[null,null,null,"R14",null,null,null,null,"=",null,{"$f":"Data!K15","v":71.88},null,null,null,null,null,null,null,null,null,null,null,null,null,null,null,null,null,null,null,null,null,null,null,{"$f":"IF(Data!$AE$2 = \"DE\", \"Prozent Flicker\", IF(Data!$AE$2 = \"UK\",\"Percent Flicker\",IF(Data!$AE$2=\"FR\",\"% flicker\",\"Language Error\")))","v":"Prozent Flicker"},null,null,null,null,null,null,null,null,null,null,null,null,null,null,null,null,null,null,null,null,null,null,null,null,null,null,null,null,null,null,{"$f":"Data!K37","v":25.5},null,null,null,null,null,null,null,null,null,null,null,null,null,null,null,null,null,null,null,null,"Rf",null,null,null,null,"=",null,{"$f":"Data!K43","v":77.599999999999994}]
[null,null,null,"R15",null,null,null,null,"=",null,{"$f":"Data!K16","v":88.02},null,null,null,null,null,null,null,null,null,null,null,null,null,null,null,null,null,null,null,null,null,null,null,{"$f":"IF(Data!$AE$2 = \"DE\", \"Flickerindex\", IF(Data!$AE$2 = \"UK\",\"Flicker index\",IF(Data!$AE$2=\"FR\",\"Index flicker\",\"Language Error\")))","v":"Flickerindex"},null,null,null,null,null,null,null,null,null,null,null,null,null,null,null,null,null,null,null,null,null,null,null,null,null,null,null,null,null,null,{"$f":"Data!K35","v":7.2999999999999995E-2},null,null,null,null,null,null,null,null,null,null,null,null,null,null,null,null,null,null,null,null,"Rg",null,null,null,null,"=",null,{"$f":"Data!K44","v":97.5}]
[]
[]
[null,null,"[nm]",null,null,null,null,null,"mW/m²/nm",null,null,null,null,null,null,null,"[nm]",null,null,null,null,null,"mW/m²/nm",null,null,null,null,null,null,null,"[nm]",null,null,null,null,null,"mW/m²/nm",null,null,null,null,null,null,null,"[nm]",null,null,null,null,null,"mW/m²/nm",null,null,null,null,null,null,null,"[nm]",null,null,null,null,null,"mW/m²/nm",null,null,null,null,null,null,null,"[nm]",null,null,null,null,null,"mW/m²/nm",null,null,null,null,null,null,null,"[nm]",null,null,null,null,null,"mW/m²/nm"]
[null,null,{"$f":"Data!G1","v":380},null,null,null,null,null,{"$f":"Data!H1","v":0.57240000000000002},null,null,null,null,null,null,null,{"$f":"Data!G13","v":440},null,null,null,null,null,{"$f":"Data!H13","v":32.883200000000002},null,null,null,null,null,null,null,{"$f":"Data!G25","v":500},null,null,null,null,null,{"$f":"Data!H25","v":13.5647},null,null,null,null,null,null,null,{"$f":"Data!G37","v":560},null,null,null,null,null,{"$f":"Data!H37","v":16.082100000000001},null,null,null,null,null,null,null,{"$f":"Data!G49","v":620},null,null,null,null,null,{"$f":"Data!H49","v":55.517299999999999},null,null,null,null,null,null,null,{"$f":"Data!G61","v":680},null,null,null,null,null,{"$f":"Data!H61","v":5.8703000000000003},null,null,null,null,null,null,null,{"$f":"Data!G73","v":740},null,null,null,null,null,{"$f":"Data!H73","v":0.86060000000000003}]
[null,null,{"$f":"Data!G2","v":385},null,null,null,null,null,{"$f":"Data!H2","v":0.20680000000000001},null,null,null,null,null,null,null,{"$f":"Data!G14","v":445},null,null,null,null,null,{"$f":"Data!H14","v":18.284300000000002},null,null,null,null,null,null,null,{"$f":"Data!G26","v":505},null,null,null,null,null,{"$f":"Data!H26","v":8.2264999999999997},null,null,null,null,null,null,null,{"$f":"Data!G38","v":565},null,null,null,null,null,{"$f":"Data!H38","v":13.2568},null,null,null,null,null,null,null,{"$f":"Data!G50","v":625},null,null,null,null,null,{"$f":"Data!H50","v":43.192900000000002},null,null,null,null,null,null,null,{"$f":"Data!G62","v":685},null,null,null,null,null,{"$f":"Data!H62","v":6.3794000000000004},null,null,null,null,null,null,null,{"$f":"Data!G74","v":745},null,null,null,null,null,{"$f":"Data!H74","v":0.86499999999999999}]
[null,null,{"$f":"Data!G3","v":390},null,null,null,null,null,{"$f":"Data!H3","v":0.46150000000000002},null,null,null,null,null,null,null,{"$f":"Data!G15","v":450},null,null,null,null,null,{"$f":"Data!H15","v":18.1922},null,null,null,null,null,null,null,{"$f":"Data!G27","v":510},null,null,null,null,null,{"$f":"Data!H27","v":6.1430999999999996},null,null,null,null,null,null,null,{"$f":"Data!G39","v":570},null,null,null,null,null,{"$f":"Data!H39","v":15.9605},null,null,null,null,null,null,null,{"$f":"Data!G51","v":630},null,null,null,null,null,{"$f":"Data!H51","v":33.598399999999998},null,null,null,null,null,null,null,{"$f":"Data!G63","v":690},null,null,null,null,null,{"$f":"Data!H63","v":5.3789999999999996},null,null,null,null,null,null,null,{"$f":"Data!G75","v":750},null,null,null,null,null,{"$f":"Data!H75","v":0.23780000000000001}]
[null,null,{"$f":"Data!G4","v":395},null,null,null,null,null,{"$f":"Data!H4","v":1.4525999999999999},null,null,null,null,null,null,null,{"$f":"Data!G16","v":455},null,null,null,null,null,{"$f":"Data!H16","v":17.9373},null,null,null,null,null,null,null,{"$f":"Data!G28","v":515},null,null,null,null,null,{"$f":"Data!H28","v":5.6165000000000003},null,null,null,null,null,null,null,{"$f":"Data!G40","v":575},null,null,null,null,null,{"$f":"Data!H40","v":28.370899999999999},null,null,null,null,null,null,null,{"$f":"Data!G52","v":635},null,null,null,null,null,{"$f":"Data!H52","v":18.711099999999998},null,null,null,null,null,null,null,{"$f":"Data!G64","v":695},null,null,null,null,null,{"$f":"Data!H64","v":4.6966999999999999},null,null,null,null,null,null,null,{"$f":"Data!G76","v":755},null,null,null,null,null,{"$f":"Data!H76","v":5.6399999999999999E-2}]
[null,null,{"$f":"Data!G5","v":400},null,null,null,null,null,{"$f":"Data!H5","v":15.3386},null,null,null,null,null,null,null,{"$f":"Data!G17","v":460},null,null,null,null,null,{"$f":"Data!H17","v":16.9191},null,null,null,null,null,null,null,{"$f":"Data!G29","v":520},null,null,null,null,null,{"$f":"Data!H29","v":5.7843},null,null,null,null,null,null,null,{"$f":"Data!G41","v":580},null,null,null,null,null,{"$f":"Data!H41","v":42.883899999999997},null,null,null,null,null,null,null,{"$f":"Data!G53","v":640},null,null,null,null,null,{"$f":"Data!H53","v":11.090999999999999},null,null,null,null,null,null,null,{"$f":"Data!G65","v":700},null,null,null,null,null,{"$f":"Data!H65","v":6.7084999999999999},null,null,null,null,null,null,null,{"$f":"Data!G77","v":760},null,null,null,null,null,{"$f":"Data!H77","v":4.9099999999999998E-2}]
[null,null,{"$f":"Data!G6","v":405},null,null,null,null,null,{"$f":"Data!H6","v":19.5168},null,null,null,null,null,null,null,{"$f":"Data!G18","v":465},null,null,null,null,null,{"$f":"Data!H18","v":15.5221},null,null,null,null,null,null,null,{"$f":"Data!G30","v":525},null,null,null,null,null,{"$f":"Data!H30","v":7.9572000000000003},null,null,null,null,null,null,null,{"$f":"Data!G42","v":585},null,null,null,null,null,{"$f":"Data!H42","v":47.615900000000003},null,null,null,null,null,null,null,{"$f":"Data!G54","v":645},null,null,null,null,null,{"$f":"Data!H54","v":10.468299999999999},null,null,null,null,null,null,null,{"$f":"Data!G66","v":705},null,null,null,null,null,{"$f":"Data!H66","v":12.506},null,null,null,null,null,null,null,{"$f":"Data!G78","v":765},null,null,null,null,null,{"$f":"Data!H78","v":0}]
[null,null,{"$f":"Data!G7","v":410},null,null,null,null,null,{"$f":"Data!H7","v":7.0986000000000002},null,null,null,null,null,null,null,{"$f":"Data!G19","v":470},null,null,null,null,null,{"$f":"Data!H19","v":14.143000000000001},null,null,null,null,null,null,null,{"$f":"Data!G31","v":530},null,null,null,null,null,{"$f":"Data!H31","v":17.520900000000001},null,null,null,null,null,null,null,{"$f":"Data!G43","v":590},null,null,null,null,null,{"$f":"Data!H43","v":43.179000000000002},null,null,null,null,null,null,null,{"$f":"Data!G55","v":650},null,null,null,null,null,{"$f":"Data!H55","v":11.261100000000001},null,null,null,null,null,null,null,{"$f":"Data!G67","v":710},null,null,null,null,null,{"$f":"Data!H67","v":13.231999999999999},null,null,null,null,null,null,null,{"$f":"Data!G79","v":770},null,null,null,null,null,{"$f":"Data!H79","v":0}]
[null,null,{"$f":"Data!G8","v":415},null,null,null,null,null,{"$f":"Data!H8","v":5.8689},null,null,null,null,null,null,null,{"$f":"Data!G20","v":475},null,null,null,null,null,{"$f":"Data!H20","v":14.642799999999999},null,null,null,null,null,null,null,{"$f":"Data!G32","v":535},null,null,null,null,null,{"$f":"Data!H32","v":56.848999999999997},null,null,null,null,null,null,null,{"$f":"Data!G44","v":595},null,null,null,null,null,{"$f":"Data!H44","v":36.741199999999999},null,null,null,null,null,null,null,{"$f":"Data!G56","v":655},null,null,null,null,null,{"$f":"Data!H56","v":10.1099},null,null,null,null,null,null,null,{"$f":"Data!G68","v":715},null,null,null,null,null,{"$f":"Data!H68","v":6.6806999999999999},null,null,null,null,null,null,null,{"$f":"Data!G80","v":775},null,null,null,null,null,{"$f":"Data!H80","v":0.10829999999999999}]
[null,null,{"$f":"Data!G9","v":420},null,null,null,null,null,{"$f":"Data!H9","v":8.2623999999999995},null,null,null,null,null,null,null,{"$f":"Data!G21","v":480},null,null,null,null,null,{"$f":"Data!H21","v":24.472799999999999},null,null,null,null,null,null,null,{"$f":"Data!G33","v":540},null,null,null,null,null,{"$f":"Data!H33","v":139.41669999999999},null,null,null,null,null,null,null,{"$f":"Data!G45","v":600},null,null,null,null,null,{"$f":"Data!H45","v":37.325099999999999},null,null,null,null,null,null,null,{"$f":"Data!G57","v":660},null,null,null,null,null,{"$f":"Data!H57","v":8.9038000000000004},null,null,null,null,null,null,null,{"$f":"Data!G69","v":720},null,null,null,null,null,{"$f":"Data!H69","v":2.5350000000000001},null,null,null,null,null,null,null,{"$f":"Data!G81","v":780},null,null,null,null,null,{"$f":"Data!H81","v":0}]
[null,null,{"$f":"Data!G10","v":425},null,null,null,null,null,{"$f":"Data!H10","v":11.879099999999999},null,null,null,null,null,null,null,{"$f":"Data!G22","v":485},null,null,null,null,null,{"$f":"Data!H22","v":39.417099999999998},null,null,null,null,null,null,null,{"$f":"Data!G34","v":545},null,null,null,null,null,{"$f":"Data!H34","v":160.0821},null,null,null,null,null,null,null,{"$f":"Data!G46","v":605},null,null,null,null,null,{"$f":"Data!H46","v":78.079499999999996},null,null,null,null,null,null,null,{"$f":"Data!G58","v":665},null,null,null,null,null,{"$f":"Data!H58","v":7.5664999999999996},null,null,null,null,null,null,null,{"$f":"Data!G70","v":725},null,null,null,null,null,{"$f":"Data!H70","v":1.5955999999999999}]
[null,null,{"$f":"Data!G11","v":430},null,null,null,null,null,{"$f":"Data!H11","v":41.239100000000001},null,null,null,null,null,null,null,{"$f":"Data!G23","v":490},null,null,null,null,null,{"$f":"Data!H23","v":36.798900000000003},null,null,null,null,null,null,null,{"$f":"Data!G35","v":550},null,null,null,null,null,{"$f":"Data!H35","v":86.403199999999998},null,null,null,null,null,null,null,{"$f":"Data!G47","v":610},null,null,null,null,null,{"$f":"Data!H47","v":135.84289999999999},null,null,null,null,null,null,null,{"$f":"Data!G59","v":670},null,null,null,null,null,{"$f":"Data!H59","v":5.6665999999999999},null,null,null,null,null,null,null,{"$f":"Data!G71","v":730},null,null,null,null,null,{"$f":"Data!H71","v":0.66190000000000004}]
[null,null,{"$f":"Data!G12","v":435},null,null,null,null,null,{"$f":"Data!H12","v":64.129900000000006},null,null,null,null,null,null,null,{"$f":"Data!G24","v":495},null,null,null,null,null,{"$f":"Data!H24","v":23.702999999999999},null,null,null,null,null,null,null,{"$f":"Data!G36","v":555},null,null,null,null,null,{"$f":"Data!H36","v":32.056899999999999},null,null,null,null,null,null,null,{"$f":"Data!G48","v":615},null,null,null,null,null,{"$f":"Data!H48","v":105.47709999999999},null,null,null,null,null,null,null,{"$f":"Data!G60","v":675},null,null,null,null,null,{"$f":"Data!H60","v":5.3181000000000003},null,null,null,null,null,null,null,{"$f":"Data!G72","v":735},null,null,null,null,null,{"$f":"Data!H72","v":0.78}]
[]
[{"$f":"IF(Data!$AE$2=\"DE\",\"Firma\",IF(Data!$AE$2=\"UK\",\"Company\",IF(Data!$AE$2=\"FR\",\"Société\",\"Language Error\")))","v":"Firma"}]
[{"$f":"IF(Data!$AE$2=\"DE\",\"Adresse\",IF(Data!$AE$2=\"UK\",\"Address\",IF(Data!$AE$2=\"FR\",\"Adresse\",\"Language Error\")))","v":"Adresse"}]
[{"$f":"IF(Data!$AE$2=\"DE\",\"PLZ  Ort\",IF(Data!$AE$2=\"UK\",\"ZIP  City\",IF(Data!$AE$2=\"FR\",\"Code postal Ville\",\"Language Error\")))","v":"PLZ  Ort"}]
[]
[{"$f":"IF(Data!$AE$2=\"DE\",\"Prüfort,\",IF(Data!$AE$2=\"UK\",\"Test location,\",IF(Data!$AE$2=\"FR\",\"Lieu de rapport, \",\"Language Error\")))","v":"Prüfort,"},null,null,null,null,null,null,null,null,null,null,null,null,null,null,{"$f":"IF(Data!$AE$2=\"DE\",\"Datum\",IF(Data!$AE$2=\"UK\",\"Date\",IF(Data!$AE$2=\"FR\",\"Date\",\"Language Error\")))","v":"Datum"},null,null,null,null,null,null,null,null,null,null,null,null,null,null,null,null,null,null,null,null,null,null,null,null,null,null,null,null,null,null,null,null,null,null,null,null,null,null,null,null,null,null,null,null,null,null,null,{"$f":"IF(Data!$AE$2=\"DE\",\"Vorname, Nachname Prüfer\",IF(Data!$AE$2=\"UK\",\"First, last name of inspector\",IF(Data!$AE$2=\"FR\",\"Prénom Nom du testeur\",\"Language Error\")))","v":"Vorname, Nachname Prüfer"},null,null,null,null,null,null,null,null,null,null,null,null,null,null,null,null,null,null,null,null,{"$f":"IF(Data!$AE$2=\"DE\",\"Telefonnummer\",IF(Data!$AE$2=\"UK\",\"Phone number\",IF(Data!$AE$2=\"FR\",\"N° téléphone\",\"Language Error\")))","v":"Telefonnummer"}]

{"sheet":"Protokoll 2 (native)","index":1,"n_rows":68,"n_cols":91,"rows_kept":68,"cut":false,"hidden":false,"merged":[[5,84,5,99],[51,85,51,89],[51,90,51,98],[52,85,52,89],[52,90,52,98],[46,85,46,89],[46,90,46,98],[47,85,47,89],[47,90,47,98],[48,85,48,89],[48,90,48,98],[49,85,49,89],[49,90,49,98],[50,85,50,89],[50,90,50,98],[41,85,41,89],[41,90,41,98],[42,85,42,89],[42,90,42,98],[36,85,36,89],[36,90,36,98],[37,85,37,89],[37,90,37,98],[38,85,38,89],[31,85,31,89],[31,90,31,98],[32,85,32,89],[32,90,32,98],[33,85,33,89],[33,90,33,98],[34,85,34,89],[34,90,34,98],[35,85,35,89],[35,90,35,98],[26,85,26,89],[26,90,26,98],[27,85,27,89],[27,90,27,98],[28,85,28,89],[28,90,28,98],[29,85,29,89],[29,90,29,98],[30,85,30,89],[30,90,30,98],[21,85,21,89],[21,90,21,98],[22,85,22,89],[22,90,22,98],[23,85,23,89],[23,90,23,98],[24,85,24,89],[24,90,24,98],[25,85,25,89],[25,90,25,98],[21,71,21,75],[21,76,21,84],[22,71,22,75],[22,76,22,84],[23,71,23,75],[23,76,23,84],[24,71,24,75],[24,76,24,84],[25,71,25,75],[25,76,25,84],[40,57,40,61],[40,62,40,70],[41,57,41,61],[41,62,41,70],[42,57,42,61],[42,62,42,70],[43,57,43,61],[43,62,43,70],[44,57,44,61],[44,62,44,70],[51,43,51,47],[51,48,51,56],[52,43,52,47],[52,48,52,56],[21,57,21,61],[21,62,21,70],[22,57,22,61],[22,62,22,70],[23,57,23,61],[23,62,23,70],[24,57,24,61],[24,62,24,70],[25,57,25,61],[25,62,25,70],[26,57,26,61],[26,62,26,70],[27,57,27,61],[27,62,27,70],[28,57,28,61],[28,62,28,70],[29,57,29,61],[29,62,29,70],[30,57,30,61],[30,62,30,70],[46,43,46,47],[46,48,46,56],[47,43,47,47],[47,48,47,56],[48,43,48,47],[48,48,48,56],[49,43,49,47],[49,48,49,56],[50,43,50,47],[50,48,50,56],[41,43,41,47],[41,48,41,56],[42,43,42,47],[42,48,42,56],[43,43,43,47],[43,48,43,56],[44,43,44,47],[44,48,44,56],[45,43,45,47],[45,48,45,56],[36,43,36,47],[36,48,36,56],[37,43,37,47],[37,48,37,56],[38,43,38,47],[38,48,38,56],[39,43,39,47],[39,48,39,56],[40,43,40,47],[40,48,40,56],[31,43,31,47],[32,43,32,47],[32,48,32,56],[33,43,33,47],[33,48,33,56],[34,43,34,47],[34,48,34,56],[35,43,35,47],[35,48,35,56],[31,48,31,56],[50,34,50,42],[51,34,51,42],[52,29,52,33],[52,34,52,42],[21,43,21,47],[21,48,21,56],[22,43,22,47],[22,48,22,56],[23,43,23,47],[23,48,23,56],[24,43,24,47],[24,48,24,56],[25,43,25,47],[25,48,25,56],[26,43,26,47],[26,48,26,56],[27,43,27,47],[27,48,27,56],[28,43,28,47],[28,48,28,56],[29,43,29,47],[29,48,29,56],[30,43,30,47],[30,48,30,56],[44,34,44,42],[45,29,45,33],[45,34,45,42],[46,34,46,42],[47,29,47,33],[47,34,47,42],[48,29,48,33],[48,34,48,42],[49,29,49,33],[49,34,49,42],[38,34,38,42],[39,29,39,33],[39,34,39,42],[40,29,40,33],[40,34,40,42],[41,34,41,42],[42,29,42,33],[42,34,42,42],[43,29,43,33],[43,34,43,42],[32,34,32,42],[33,29,33,33],[33,34,33,42],[34,29,34,33],[34,34,34,42],[35,29,35,33],[35,34,35,42],[36,34,36,42],[37,29,37,33],[37,34,37,42],[26,34,26,42],[27,29,27,33],[27,34,27,42],[28,29,28,33],[28,34,28,42],[29,29,29,33],[29,34,29,42],[30,29,30,33],[30,34,30,42],[26,29,26,33],[21,34,21,42],[22,29,22,33],[22,34,22,42],[23,29,23,33],[23,34,23,42],[24,29,24,33],[24,34,24,42],[25,29,25,33],[25,34,25,42],[21,29,21,33],[31,29,31,33],[36,29,36,33],[41,29,41,33],[46,29,46,33],[51,29,51,33],[44,15,44,19],[44,20,44,28],[45,15,45,19],[45,20,45,28],[46,15,46,19],[46,20,46,28],[47,15,47,19],[47,20,47,28],[48,15,48,19],[38,29,38,33],[44,29,44,33],[50,29,50,33],[43,15,43,19],[43,20,43,28],[49,15,49,19],[49,20,49,28],[50,15,50,19],[50,20,50,28],[51,15,51,19],[51,20,51,28],[52,15,52,19],[52,20,52,28],[21,15,21,19],[21,20,21,28],[22,15,22,19],[22,20,22,28],[23,15,23,19],[23,20,23,28],[24,15,24,19],[24,20,24,28],[25,15,25,19],[25,20,25,28],[26,15,26,19],[26,20,26,28],[42,15,42,19],[42,20,42,28],[30,15,30,19],[30,20,30,28],[31,15,31,19],[31,20,31,28],[32,15,32,19],[32,20,32,28],[33,15,33,19],[47,1,47,5],[48,1,48,5],[49,1,49,5],[50,1,50,5],[51,1,51,5],[52,1,52,5],[21,6,21,14],[22,6,22,14],[23,6,23,14],[24,6,24,14],[25,6,25,14],[26,6,26,14],[27,6,27,14],[28,6,28,14],[29,6,29,14],[30,6,30,14],[31,6,31,14],[32,6,32,14],[33,6,33,14],[34,6,34,14],[35,6,35,14],[36,6,36,14],[37,6,37,14],[38,6,38,14],[22,1,22,5],[21,1,21,5],[23,1,23,5],[24,1,24,5],[25,1,25,5],[26,1,26,5],[27,1,27,5],[28,1,28,5],[29,1,29,5],[47,6,47,14],[48,6,48,14],[49,6,49,14],[50,6,50,14],[51,6,51,14],[52,6,52,14],[27,15,27,19],[27,20,27,28],[28,15,28,19],[28,20,28,28],[29,15,29,19],[29,20,29,28],[39,6,39,14],[40,6,40,14],[41,6,41,14],[42,6,42,14],[43,6,43,14],[48,20,48,28],[39,15,39,19],[39,20,39,28],[40,15,40,19],[40,20,40,28],[41,15,41,19],[41,20,41,28],[39,1,39,5],[40,1,40,5],[41,1,41,5],[42,1,42,5],[44,6,44,14],[45,6,45,14],[46,6,46,14],[30,1,30,5],[31,1,31,5],[32,1,32,5],[33,1,33,5],[34,1,34,5],[35,1,35,5],[36,1,36,5],[37,1,37,5],[38,1,38,5],[43,1,43,5],[44,1,44,5],[45,1,45,5],[46,1,46,5],[53,135,53,140],[32,155,32,160],[42,161,42,164],[42,165,42,170],[33,115,33,120],[22,115,22,120],[22,155,22,160],[29,121,29,124],[25,121,25,124],[26,121,26,124],[27,115,27,120],[28,115,28,120],[29,115,29,120],[37,121,37,124],[38,121,38,124],[39,121,39,124],[24,115,24,120],[25,115,25,120],[26,115,26,120],[34,121,34,124],[33,155,33,160],[34,155,34,160],[23,145,23,150],[24,145,24,150],[22,161,22,164],[22,165,22,170],[22,135,22,140],[22,145,22,150],[22,151,22,154],[36,115,36,120],[42,115,42,120],[48,115,48,120],[42,125,42,130],[33,125,33,130],[25,125,25,130],[30,115,30,120],[31,115,31,120],[35,115,35,120],[34,115,34,120],[36,155,36,160],[37,155,37,160],[38,155,38,160],[47,115,47,120],[46,115,46,120],[45,115,45,120],[44,115,44,120],[43,115,43,120],[48,135,48,140],[38,115,38,120],[48,155,48,160],[49,155,49,160],[50,155,50,160],[47,155,47,160],[42,151,42,154],[39,151,39,154],[44,125,44,130],[45,125,45,130],[40,135,40,140],[41,135,41,140],[44,135,44,140],[45,135,45,140],[46,141,46,144],[43,135,43,140],[41,131,41,134],[47,125,47,130],[48,121,48,124],[48,125,48,130],[41,125,41,130],[43,151,43,154],[44,151,44,154],[45,151,45,154],[46,151,46,154],[37,151,37,154],[40,151,40,154],[41,151,41,154],[45,155,45,160],[46,155,46,160],[40,155,40,160],[41,155,41,160],[38,151,38,154],[50,135,50,140],[47,135,47,140],[38,141,38,144],[39,141,39,144],[40,141,40,144],[47,151,47,154],[44,145,44,150],[45,145,45,150],[46,145,46,150],[47,145,47,150],[48,145,48,150],[49,125,49,130],[49,135,49,140],[46,121,46,124],[46,125,46,130],[46,135,46,140],[48,151,48,154],[49,151,49,154],[50,151,50,154],[43,141,43,144],[53,141,53,144],[50,141,50,144],[51,141,51,144],[52,141,52,144],[50,145,50,150],[51,145,51,150],[52,145,52,150],[49,141,49,144],[51,151,51,154],[52,151,52,154],[53,151,53,154],[53,145,53,150],[49,145,49,150],[29,151,29,154],[29,155,29,160],[40,125,40,130],[30,111,30,114],[40,121,40,124],[39,125,39,130],[29,111,29,114],[38,125,38,130],[37,125,37,130],[36,125,36,130],[35,125,35,130],[34,125,34,130],[32,125,32,130],[31,125,31,130],[30,125,30,130],[29,125,29,130],[35,131,35,134],[36,131,36,134],[37,131,37,134],[32,131,32,134],[33,131,33,134],[34,131,34,134],[35,141,35,144],[36,141,36,144],[52,125,52,130],[53,125,53,130],[41,121,41,124],[42,121,42,124],[47,121,47,124],[28,125,28,130],[27,125,27,130],[26,125,26,130],[24,111,24,114],[25,111,25,114],[26,111,26,114],[27,111,27,114],[28,111,28,114],[27,121,27,124],[28,121,28,124],[24,125,24,130],[53,115,53,120],[52,115,52,120],[51,115,51,120],[50,115,50,120],[49,115,49,120],[47,111,47,114],[48,111,48,114],[52,111,52,114],[53,111,53,114],[23,121,23,124],[49,111,49,114],[50,111,50,114],[51,111,51,114],[24,121,24,124],[35,121,35,124],[36,121,36,124],[23,115,23,120],[33,121,33,124],[30,121,30,124],[31,121,31,124],[32,121,32,124],[23,111,23,114],[31,111,31,114],[32,111,32,114],[32,115,32,120],[45,121,45,124],[37,115,37,120],[49,121,49,124],[50,121,50,124],[41,115,41,120],[40,115,40,120],[39,115,39,120],[23,131,23,134],[24,131,24,134],[25,131,25,134],[51,121,51,124],[52,121,52,124],[53,121,53,124],[29,131,29,134],[30,131,30,134],[31,131,31,134],[48,131,48,134],[49,131,49,134],[50,131,50,134],[45,131,45,134],[46,131,46,134],[47,131,47,134],[43,131,43,134],[44,131,44,134],[42,131,42,134],[38,131,38,134],[39,131,39,134],[40,131,40,134],[23,125,23,130],[50,125,50,130],[51,125,51,130],[33,20,33,28],[34,15,34,19],[34,20,34,28],[35,15,35,19],[35,20,35,28],[36,15,36,19],[36,20,36,28],[37,15,37,19],[37,20,37,28],[38,15,38,19],[38,20,38,28],[31,34,31,42],[32,29,32,33],[33,141,33,144],[34,141,34,144],[36,135,36,140],[41,141,41,144],[42,141,42,144],[42,135,42,140],[37,135,37,140],[34,135,34,140],[35,135,35,140],[38,71,38,75],[38,76,38,84],[39,71,39,75],[39,76,39,84],[40,71,40,75],[40,76,40,84],[32,76,32,84],[33,71,33,75],[33,76,33,84],[34,71,34,75],[34,76,34,84],[32,145,32,150],[33,145,33,150],[34,145,34,150],[38,145,38,150],[39,145,39,150],[40,145,40,150],[35,145,35,150],[36,145,36,150],[37,145,37,150],[23,161,23,164],[24,161,24,164],[25,161,25,164],[41,145,41,150],[42,145,42,150],[43,145,43,150],[26,161,26,164],[27,161,27,164],[28,161,28,164],[23,155,23,160],[24,155,24,160],[25,155,25,160],[23,151,23,154],[24,151,24,154],[25,151,25,154],[25,145,25,150],[29,145,29,150],[30,145,30,150],[31,145,31,150],[29,161,29,164],[30,161,30,164],[31,161,31,164],[38,161,38,164],[33,161,33,164],[34,161,34,164],[35,161,35,164],[32,161,32,164],[35,155,35,160],[43,161,43,164],[44,161,44,164],[42,155,42,160],[43,155,43,160],[44,155,44,160],[39,155,39,160],[46,161,46,164],[23,165,23,170],[24,165,24,170],[25,165,25,170],[51,155,51,160],[52,155,52,160],[53,155,53,160],[32,165,32,170],[29,165,29,170],[30,165,30,170],[31,165,31,170],[26,165,26,170],[27,165,27,170],[28,165,28,170],[36,165,36,170],[37,165,37,170],[38,165,38,170],[33,165,33,170],[34,165,34,170],[35,165,35,170],[46,165,46,170],[43,165,43,170],[44,165,44,170],[45,165,45,170],[26,155,26,160],[32,57,32,61],[32,62,32,70],[33,57,33,61],[33,62,33,70],[34,57,34,61],[34,62,34,70],[35,57,35,61],[35,62,35,70],[31,57,31,61],[31,62,31,70],[26,71,26,75],[26,76,26,84],[27,71,27,75],[27,76,27,84],[28,71,28,75],[28,76,28,84],[29,71,29,75],[29,76,29,84],[30,71,30,75],[30,76,30,84],[31,71,31,75],[31,76,31,84],[32,71,32,75],[45,57,45,61],[46,57,46,61],[47,57,47,61],[48,57,48,61],[49,57,49,61],[52,57,52,61],[36,57,36,61],[36,62,36,70],[37,57,37,61],[37,62,37,70],[38,57,38,61],[38,62,38,70],[39,57,39,61],[39,62,39,70],[45,62,45,70],[46,62,46,70],[47,62,47,70],[48,62,48,70],[49,62,49,70],[50,57,50,61],[50,62,50,70],[51,57,51,61],[51,62,51,70],[52,62,52,70],[35,71,35,75],[35,76,35,84],[40,111,40,114],[41,111,41,114],[42,111,42,114],[43,111,43,114],[44,111,44,114],[45,111,45,114],[46,111,46,114],[46,71,46,75],[46,76,46,84],[43,85,43,89],[43,90,43,98],[44,85,44,89],[44,90,44,98],[45,85,45,89],[45,90,45,98],[38,90,38,98],[39,85,39,89],[39,90,39,98],[40,85,40,89],[40,90,40,98],[22,111,22,114],[33,111,33,114],[34,111,34,114],[35,111,35,114],[36,111,36,114],[37,111,37,114],[38,111,38,114],[39,111,39,114],[26,145,26,150],[27,145,27,150],[28,145,28,150],[22,121,22,124],[22,125,22,130],[23,135,23,140],[24,135,24,140],[38,135,38,140],[39,135,39,140],[31,135,31,140],[32,135,32,140],[33,135,33,140],[29,135,29,140],[30,135,30,140],[26,131,26,134],[27,131,27,134],[26,151,26,154],[27,151,27,154],[28,151,28,154],[28,135,28,140],[36,151,36,154],[51,71,51,75],[51,76,51,84],[49,71,49,75],[49,76,49,84],[50,71,50,75],[50,76,50,84],[41,71,41,75],[41,76,41,84],[42,71,42,75],[42,76,42,84],[43,71,43,75],[43,76,43,84],[44,71,44,75],[44,76,44,84],[45,71,45,75],[45,76,45,84],[43,121,43,124],[43,125,43,130],[44,121,44,124],[28,131,28,134],[53,131,53,134],[23,141,23,144],[24,141,24,144],[25,141,25,144],[26,141,26,144],[27,141,27,144],[28,141,28,144],[29,141,29,144],[30,141,30,144],[31,141,31,144],[32,141,32,144],[25,135,25,140],[26,135,26,140],[27,135,27,140],[51,131,51,134],[51,135,51,140],[52,131,52,134],[52,135,52,140],[47,141,47,144],[48,141,48,144],[37,141,37,144],[44,141,44,144],[45,141,45,144],[45,161,45,164],[67,63,67,83],[67,84,67,101],[0,0,1,53],[39,161,39,164],[39,165,39,170],[40,161,40,164],[40,165,40,170],[41,161,41,164],[41,165,41,170],[30,151,30,154],[30,155,30,160],[31,151,31,154],[31,155,31,160],[27,155,27,160],[28,155,28,160],[36,161,36,164],[37,161,37,164],[22,141,22,144],[32,151,32,154],[33,151,33,154],[34,151,34,154],[35,151,35,154],[22,131,22,134],[63,0,63,26],[64,0,64,26],[65,0,65,26],[67,0,67,14],[67,15,67,26],[3,62,3,83],[3,84,3,99],[4,62,4,83],[4,84,4,99],[5,62,5,83],[3,0,3,12],[3,13,3,58],[4,13,4,58],[5,13,5,58],[52,71,52,75],[52,76,52,84],[47,71,47,75],[47,76,47,84],[48,71,48,75],[48,76,48,84],[36,71,36,75],[36,76,36,84],[37,71,37,75],[37,76,37,84]]}
[{"$f":"IF(Data!$AE$2=\"DE\",\"Messprotokoll\",IF(Data!$AE$2=\"UK\",\"Measurement protocol\",IF(Data!$AE$2=\"FR\",\"Rapport de mesure\",\"Language Error\")))","v":"Messprotokoll"}]
[]
[]
[{"$f":"IF(Data!$AE$2 = \"DE\", \"Prüfling:\", IF(Data!$AE$2 = \"UK\",\"Test object:\",IF(Data!$AE$2=\"FR\",\"Objet testé:\",\"Language Error\")))","v":"Prüfling:"},null,null,null,null,null,null,null,null,null,null,null,null,{"$f":"'Protokoll 1 (5nm)'!N4:BG4","v":"Philips"},null,null,null,null,null,null,null,null,null,null,null,null,null,null,null,null,null,null,null,null,null,null,null,null,null,null,null,null,null,null,null,null,null,null,null,null,null,null,null,null,null,null,null,null,null,null,null,null,{"$f":"IF(Data!$AE$2=\"DE\",\"Messdatei:\",IF(Data!$AE$2=\"UK\",\"Measurement file:\",IF(Data!$AE$2=\"FR\",\"Fichier de mesure:\",\"Language Error\")))","v":"Messdatei:"},null,null,null,null,null,null,null,null,null,null,null,null,null,null,null,null,null,null,null,null,null,{"$f":"Data!Q18","v":"Test-M.CSV"}]
[null,null,null,null,null,null,null,null,null,null,null,null,null,{"$f":"'Protokoll 1 (5nm)'!N5:BG5","v":"Master TL-D Super 80"},null,null,null,null,null,null,null,null,null,null,null,null,null,null,null,null,null,null,null,null,null,null,null,null,null,null,null,null,null,null,null,null,null,null,null,null,null,null,null,null,null,null,null,null,null,null,null,null,{"$f":"IF(Data!$AE$2=\"DE\",\"Datum der Messung:\",IF(Data!$AE$2=\"UK\",\"Date of measurement:\",IF(Data!$AE$2=\"FR\",\"Date de mesure:\",\"Language Error\")))","v":"Datum der Messung:"},null,null,null,null,null,null,null,null,null,null,null,null,null,null,null,null,null,null,null,null,null,{"$f":"Data!Q23","v":"03.03.2017"}]
[null,null,null,null,null,null,null,null,null,null,null,null,null,{"$f":"'Protokoll 1 (5nm)'!N6:BG6","v":"36W/840"},null,null,null,null,null,null,null,null,null,null,null,null,null,null,null,null,null,null,null,null,null,null,null,null,null,null,null,null,null,null,null,null,null,null,null,null,null,null,null,null,null,null,null,null,null,null,null,null,{"$f":"IF(Data!$AE$2=\"DE\",\"Uhrzeit der Messung:\",IF(Data!$AE$2=\"UK\",\"Time of measurement:\",IF(Data!$AE$2=\"FR\",\"Heure de mesure:\",\"Language Error\")))","v":"Uhrzeit der Messung:"},null,null,null,null,null,null,null,null,null,null,null,null,null,null,null,null,null,null,null,null,null,{"$f":"Data!Q21","v":"08:17:53"}]
[]
[]
[]
[]
[]
[]
[]
[]
[]
[]
[]
[]
[]
[]
[]
[null,"[nm]",null,null,null,null,"mW/m²/nm",null,null,null,null,null,null,null,null,"[nm]",null,null,null,null,"mW/m²/nm",null,null,null,null,null,null,null,null,"[nm]",null,null,null,null,"mW/m²/nm",null,null,null,null,null,null,null,null,"[nm]",null,null,null,null,"mW/m²/nm",null,null,null,null,null,null,null,null,"[nm]",null,null,null,null,"mW/m²/nm",null,null,null,null,null,null,null,null,"[nm]",null,null,null,null,"mW/m²/nm",null,null,null,null,null,null,null,null,"[nm]",null,null,null,null,"mW/m²/nm"]
[null,{"$f":"Data!$G1","v":380},null,null,null,null,{"$f":"Data!$H1","v":0.57240000000000002},null,null,null,null,null,null,null,null,{"$f":"Data!$G32","v":535},null,null,null,null,{"$f":"Data!$H32","v":56.848999999999997},null,null,null,null,null,null,null,null,{"$f":"IF(Data!$G63=\"\",\"\",Data!$G63)","v":690},null,null,null,null,{"$f":"IF(Data!$H63=\"\",\"\",Data!$H63)","v":5.3789999999999996},null,null,null,null,null,null,null,null,{"$f":"IF(Data!$G94=\"\",\"\",Data!$G94)","v":""},null,null,null,null,{"$f":"IF(Data!$H94=\"\",\"\",Data!$H94)","v":""},null,null,null,null,null,null,null,null,{"$f":"IF(Data!$G125=\"\",\"\",Data!$G125)","v":""},null,null,null,null,{"$f":"IF(Data!$H125=\"\",\"\",Data!$H125)","v":""},null,null,null,null,null,null,null,null,{"$f":"IF(Data!$G156=\"\",\"\",Data!$G156)","v":""},null,null,null,null,{"$f":"IF(Data!$H156=\"\",\"\",Data!$H156)","v":""},null,null,null,null,null,null,null,null,{"$f":"IF(Data!$G187=\"\",\"\",Data!$G187)","v":""},null,null,null,null,{"$f":"IF(Data!$H187=\"\",\"\",Data!$H187)","v":""}]
[null,{"$f":"Data!$G2","v":385},null,null,null,null,{"$f":"Data!$H2","v":0.20680000000000001},null,null,null,null,null,null,null,null,{"$f":"Data!$G33","v":540},null,null,null,null,{"$f":"Data!$H33","v":139.41669999999999},null,null,null,null,null,null,null,null,{"$f":"IF(Data!$G64=\"\",\"\",Data!$G64)","v":695},null,null,null,null,{"$f":"IF(Data!$H64=\"\",\"\",Data!$H64)","v":4.6966999999999999},null,null,null,null,null,null,null,null,{"$f":"IF(Data!$G95=\"\",\"\",Data!$G95)","v":""},null,null,null,null,{"$f":"IF(Data!$H95=\"\",\"\",Data!$H95)","v":""},null,null,null,null,null,null,null,null,{"$f":"IF(Data!$G126=\"\",\"\",Data!$G126)","v":""},null,null,null,null,{"$f":"IF(Data!$H126=\"\",\"\",Data!$H126)","v":""},null,null,null,null,null,null,null,null,{"$f":"IF(Data!$G157=\"\",\"\",Data!$G157)","v":""},null,null,null,null,{"$f":"IF(Data!$H157=\"\",\"\",Data!$H157)","v":""},null,null,null,null,null,null,null,null,{"$f":"IF(Data!$G188=\"\",\"\",Data!$G188)","v":""},null,null,null,null,{"$f":"IF(Data!$H188=\"\",\"\",Data!$H188)","v":""}]
[null,{"$f":"Data!$G3","v":390},null,null,null,null,{"$f":"Data!$H3","v":0.46150000000000002},null,null,null,null,null,null,null,null,{"$f":"Data!$G34","v":545},null,null,null,null,{"$f":"Data!$H34","v":160.0821},null,null,null,null,null,null,null,null,{"$f":"IF(Data!$G65=\"\",\"\",Data!$G65)","v":700},null,null,null,null,{"$f":"IF(Data!$H65=\"\",\"\",Data!$H65)","v":6.7084999999999999},null,null,null,null,null,null,null,null,{"$f":"IF(Data!$G96=\"\",\"\",Data!$G96)","v":""},null,null,null,null,{"$f":"IF(Data!$H96=\"\",\"\",Data!$H96)","v":""},null,null,null,null,null,null,null,null,{"$f":"IF(Data!$G127=\"\",\"\",Data!$G127)","v":""},null,null,null,null,{"$f":"IF(Data!$H127=\"\",\"\",Data!$H127)","v":""},null,null,null,null,null,null,null,null,{"$f":"IF(Data!$G158=\"\",\"\",Data!$G158)","v":""},null,null,null,null,{"$f":"IF(Data!$H158=\"\",\"\",Data!$H158)","v":""},null,null,null,null,null,null,null,null,{"$f":"IF(Data!$G189=\"\",\"\",Data!$G189)","v":""},null,null,null,null,{"$f":"IF(Data!$H189=\"\",\"\",Data!$H189)","v":""}]
[null,{"$f":"Data!$G4","v":395},null,null,null,null,{"$f":"Data!$H4","v":1.4525999999999999},null,null,null,null,null,null,null,null,{"$f":"Data!$G35","v":550},null,null,null,null,{"$f":"Data!$H35","v":86.403199999999998},null,null,null,null,null,null,null,null,{"$f":"IF(Data!$G66=\"\",\"\",Data!$G66)","v":705},null,null,null,null,{"$f":"IF(Data!$H66=\"\",\"\",Data!$H66)","v":12.506},null,null,null,null,null,null,null,null,{"$f":"IF(Data!$G97=\"\",\"\",Data!$G97)","v":""},null,null,null,null,{"$f":"IF(Data!$H97=\"\",\"\",Data!$H97)","v":""},null,null,null,null,null,null,null,null,{"$f":"IF(Data!$G128=\"\",\"\",Data!$G128)","v":""},null,null,null,null,{"$f":"IF(Data!$H128=\"\",\"\",Data!$H128)","v":""},null,null,null,null,null,null,null,null,{"$f":"IF(Data!$G159=\"\",\"\",Data!$G159)","v":""},null,null,null,null,{"$f":"IF(Data!$H159=\"\",\"\",Data!$H159)","v":""},null,null,null,null,null,null,null,null,{"$f":"IF(Data!$G190=\"\",\"\",Data!$G190)","v":""},null,null,null,null,{"$f":"IF(Data!$H190=\"\",\"\",Data!$H190)","v":""}]
[null,{"$f":"Data!$G5","v":400},null,null,null,null,{"$f":"Data!$H5","v":15.3386},null,null,null,null,null,null,null,null,{"$f":"Data!$G36","v":555},null,null,null,null,{"$f":"Data!$H36","v":32.056899999999999},null,null,null,null,null,null,null,null,{"$f":"IF(Data!$G67=\"\",\"\",Data!$G67)","v":710},null,null,null,null,{"$f":"IF(Data!$H67=\"\",\"\",Data!$H67)","v":13.231999999999999},null,null,null,null,null,null,null,null,{"$f":"IF(Data!$G98=\"\",\"\",Data!$G98)","v":""},null,null,null,null,{"$f":"IF(Data!$H98=\"\",\"\",Data!$H98)","v":""},null,null,null,null,null,null,null,null,{"$f":"IF(Data!$G129=\"\",\"\",Data!$G129)","v":""},null,null,null,null,{"$f":"IF(Data!$H129=\"\",\"\",Data!$H129)","v":""},null,null,null,null,null,null,null,null,{"$f":"IF(Data!$G160=\"\",\"\",Data!$G160)","v":""},null,null,null,null,{"$f":"IF(Data!$H160=\"\",\"\",Data!$H160)","v":""},null,null,null,null,null,null,null,null,{"$f":"IF(Data!$G191=\"\",\"\",Data!$G191)","v":""},null,null,null,null,{"$f":"IF(Data!$H191=\"\",\"\",Data!$H191)","v":""}]
[null,{"$f":"Data!$G6","v":405},null,null,null,null,{"$f":"Data!$H6","v":19.5168},null,null,null,null,null,null,null,null,{"$f":"Data!$G37","v":560},null,null,null,null,{"$f":"Data!$H37","v":16.082100000000001},null,null,null,null,null,null,null,null,{"$f":"IF(Data!$G68=\"\",\"\",Data!$G68)","v":715},null,null,null,null,{"$f":"IF(Data!$H68=\"\",\"\",Data!$H68)","v":6.6806999999999999},null,null,null,null,null,null,null,null,{"$f":"IF(Data!$G99=\"\",\"\",Data!$G99)","v":""},null,null,null,null,{"$f":"IF(Data!$H99=\"\",\"\",Data!$H99)","v":""},null,null,null,null,null,null,null,null,{"$f":"IF(Data!$G130=\"\",\"\",Data!$G130)","v":""},null,null,null,null,{"$f":"IF(Data!$H130=\"\",\"\",Data!$H130)","v":""},null,null,null,null,null,null,null,null,{"$f":"IF(Data!$G161=\"\",\"\",Data!$G161)","v":""},null,null,null,null,{"$f":"IF(Data!$H161=\"\",\"\",Data!$H161)","v":""},null,null,null,null,null,null,null,null,{"$f":"IF(Data!$G192=\"\",\"\",Data!$G192)","v":""},null,null,null,null,{"$f":"IF(Data!$H192=\"\",\"\",Data!$H192)","v":""}]
[null,{"$f":"Data!$G7","v":410},null,null,null,null,{"$f":"Data!$H7","v":7.0986000000000002},null,null,null,null,null,null,null,null,{"$f":"Data!$G38","v":565},null,null,null,null,{"$f":"Data!$H38","v":13.2568},null,null,null,null,null,null,null,null,{"$f":"IF(Data!$G69=\"\",\"\",Data!$G69)","v":720},null,null,null,null,{"$f":"IF(Data!$H69=\"\",\"\",Data!$H69)","v":2.5350000000000001},null,null,null,null,null,null,null,null,{"$f":"IF(Data!$G100=\"\",\"\",Data!$G100)","v":""},null,null,null,null,{"$f":"IF(Data!$H100=\"\",\"\",Data!$H100)","v":""},null,null,null,null,null,null,null,null,{"$f":"IF(Data!$G131=\"\",\"\",Data!$G131)","v":""},null,null,null,null,{"$f":"IF(Data!$H131=\"\",\"\",Data!$H131)","v":""},null,null,null,null,null,null,null,null,{"$f":"IF(Data!$G162=\"\",\"\",Data!$G162)","v":""},null,null,null,null,{"$f":"IF(Data!$H162=\"\",\"\",Data!$H162)","v":""},null,null,null,null,null,null,null,null,{"$f":"IF(Data!$G193=\"\",\"\",Data!$G193)","v":""},null,null,null,null,{"$f":"IF(Data!$H193=\"\",\"\",Data!$H193)","v":""}]
[null,{"$f":"Data!$G8","v":415},null,null,null,null,{"$f":"Data!$H8","v":5.8689},null,null,null,null,null,null,null,null,{"$f":"Data!$G39","v":570},null,null,null,null,{"$f":"Data!$H39","v":15.9605},null,null,null,null,null,null,null,null,{"$f":"IF(Data!$G70=\"\",\"\",Data!$G70)","v":725},null,null,null,null,{"$f":"IF(Data!$H70=\"\",\"\",Data!$H70)","v":1.5955999999999999},null,null,null,null,null,null,null,null,{"$f":"IF(Data!$G101=\"\",\"\",Data!$G101)","v":""},null,null,null,null,{"$f":"IF(Data!$H101=\"\",\"\",Data!$H101)","v":""},null,null,null,null,null,null,null,null,{"$f":"IF(Data!$G132=\"\",\"\",Data!$G132)","v":""},null,null,null,null,{"$f":"IF(Data!$H132=\"\",\"\",Data!$H132)","v":""},null,null,null,null,null,null,null,null,{"$f":"IF(Data!$G163=\"\",\"\",Data!$G163)","v":""},null,null,null,null,{"$f":"IF(Data!$H163=\"\",\"\",Data!$H163)","v":""},null,null,null,null,null,null,null,null,{"$f":"IF(Data!$G194=\"\",\"\",Data!$G194)","v":""},null,null,null,null,{"$f":"IF(Data!$H194=\"\",\"\",Data!$H194)","v":""}]
[null,{"$f":"Data!$G9","v":420},null,null,null,null,{"$f":"Data!$H9","v":8.2623999999999995},null,null,null,null,null,null,null,null,{"$f":"Data!$G40","v":575},null,null,null,null,{"$f":"Data!$H40","v":28.370899999999999},null,null,null,null,null,null,null,null,{"$f":"IF(Data!$G71=\"\",\"\",Data!$G71)","v":730},null,null,null,null,{"$f":"IF(Data!$H71=\"\",\"\",Data!$H71)","v":0.66190000000000004},null,null,null,null,null,null,null,null,{"$f":"IF(Data!$G102=\"\",\"\",Data!$G102)","v":""},null,null,null,null,{"$f":"IF(Data!$H102=\"\",\"\",Data!$H102)","v":""},null,null,null,null,null,null,null,null,{"$f":"IF(Data!$G133=\"\",\"\",Data!$G133)","v":""},null,null,null,null,{"$f":"IF(Data!$H133=\"\",\"\",Data!$H133)","v":""},null,null,null,null,null,null,null,null,{"$f":"IF(Data!$G164=\"\",\"\",Data!$G164)","v":""},null,null,null,null,{"$f":"IF(Data!$H164=\"\",\"\",Data!$H164)","v":""},null,null,null,null,null,null,null,null,{"$f":"IF(Data!$G195=\"\",\"\",Data!$G195)","v":""},null,null,null,null,{"$f":"IF(Data!$H195=\"\",\"\",Data!$H195)","v":""}]
[null,{"$f":"Data!$G10","v":425},null,null,null,null,{"$f":"Data!$H10","v":11.879099999999999},null,null,null,null,null,null,null,null,{"$f":"Data!$G41","v":580},null,null,null,null,{"$f":"Data!$H41","v":42.883899999999997},null,null,null,null,null,null,null,null,{"$f":"IF(Data!$G72=\"\",\"\",Data!$G72)","v":735},null,null,null,null,{"$f":"IF(Data!$H72=\"\",\"\",Data!$H72)","v":0.78},null,null,null,null,null,null,null,null,{"$f":"IF(Data!$G103=\"\",\"\",Data!$G103)","v":""},null,null,null,null,{"$f":"IF(Data!$H103=\"\",\"\",Data!$H103)","v":""},null,null,null,null,null,null,null,null,{"$f":"IF(Data!$G134=\"\",\"\",Data!$G134)","v":""},null,null,null,null,{"$f":"IF(Data!$H134=\"\",\"\",Data!$H134)","v":""},null,null,null,null,null,null,null,null,{"$f":"IF(Data!$G165=\"\",\"\",Data!$G165)","v":""},null,null,null,null,{"$f":"IF(Data!$H165=\"\",\"\",Data!$H165)","v":""},null,null,null,null,null,null,null,null,{"$f":"IF(Data!$G196=\"\",\"\",Data!$G196)","v":""},null,null,null,null,{"$f":"IF(Data!$H196=\"\",\"\",Data!$H196)","v":""}]
[null,{"$f":"Data!$G11","v":430},null,null,null,null,{"$f":"Data!$H11","v":41.239100000000001},null,null,null,null,null,null,null,null,{"$f":"Data!$G42","v":585},null,null,null,null,{"$f":"Data!$H42","v":47.615900000000003},null,null,null,null,null,null,null,null,{"$f":"IF(Data!$G73=\"\",\"\",Data!$G73)","v":740},null,null,null,null,{"$f":"IF(Data!$H73=\"\",\"\",Data!$H73)","v":0.86060000000000003},null,null,null,null,null,null,null,null,{"$f":"IF(Data!$G104=\"\",\"\",Data!$G104)","v":""},null,null,null,null,{"$f":"IF(Data!$H104=\"\",\"\",Data!$H104)","v":""},null,null,null,null,null,null,null,null,{"$f":"IF(Data!$G135=\"\",\"\",Data!$G135)","v":""},null,null,null,null,{"$f":"IF(Data!$H135=\"\",\"\",Data!$H135)","v":""},null,null,null,null,null,null,null,null,{"$f":"IF(Data!$G166=\"\",\"\",Data!$G166)","v":""},null,null,null,null,{"$f":"IF(Data!$H166=\"\",\"\",Data!$H166)","v":""},null,null,null,null,null,null,null,null,{"$f":"IF(Data!$G197=\"\",\"\",Data!$G197)","v":""},null,null,null,null,{"$f":"IF(Data!$H197=\"\",\"\",Data!$H197)","v":""}]
[null,{"$f":"Data!$G12","v":435},null,null,null,null,{"$f":"Data!$H12","v":64.129900000000006},null,null,null,null,null,null,null,null,{"$f":"Data!$G43","v":590},null,null,null,null,{"$f":"Data!$H43","v":43.179000000000002},null,null,null,null,null,null,null,null,{"$f":"IF(Data!$G74=\"\",\"\",Data!$G74)","v":745},null,null,null,null,{"$f":"IF(Data!$H74=\"\",\"\",Data!$H74)","v":0.86499999999999999},null,null,null,null,null,null,null,null,{"$f":"IF(Data!$G105=\"\",\"\",Data!$G105)","v":""},null,null,null,null,{"$f":"IF(Data!$H105=\"\",\"\",Data!$H105)","v":""},null,null,null,null,null,null,null,null,{"$f":"IF(Data!$G136=\"\",\"\",Data!$G136)","v":""},null,null,null,null,{"$f":"IF(Data!$H136=\"\",\"\",Data!$H136)","v":""},null,null,null,null,null,null,null,null,{"$f":"IF(Data!$G167=\"\",\"\",Data!$G167)","v":""},null,null,null,null,{"$f":"IF(Data!$H167=\"\",\"\",Data!$H167)","v":""},null,null,null,null,null,null,null,null,{"$f":"IF(Data!$G198=\"\",\"\",Data!$G198)","v":""},null,null,null,null,{"$f":"IF(Data!$H198=\"\",\"\",Data!$H198)","v":""}]
[null,{"$f":"Data!$G13","v":440},null,null,null,null,{"$f":"Data!$H13","v":32.883200000000002},null,null,null,null,null,null,null,null,{"$f":"Data!$G44","v":595},null,null,null,null,{"$f":"Data!$H44","v":36.741199999999999},null,null,null,null,null,null,null,null,{"$f":"IF(Data!$G75=\"\",\"\",Data!$G75)","v":750},null,null,null,null,{"$f":"IF(Data!$H75=\"\",\"\",Data!$H75)","v":0.23780000000000001},null,null,null,null,null,null,null,null,{"$f":"IF(Data!$G106=\"\",\"\",Data!$G106)","v":""},null,null,null,null,{"$f":"IF(Data!$H106=\"\",\"\",Data!$H106)","v":""},null,null,null,null,null,null,null,null,{"$f":"IF(Data!$G137=\"\",\"\",Data!$G137)","v":""},null,null,null,null,{"$f":"IF(Data!$H137=\"\",\"\",Data!$H137)","v":""},null,null,null,null,null,null,null,null,{"$f":"IF(Data!$G168=\"\",\"\",Data!$G168)","v":""},null,null,null,null,{"$f":"IF(Data!$H168=\"\",\"\",Data!$H168)","v":""},null,null,null,null,null,null,null,null,{"$f":"IF(Data!$G199=\"\",\"\",Data!$G199)","v":""},null,null,null,null,{"$f":"IF(Data!$H199=\"\",\"\",Data!$H199)","v":""}]
[null,{"$f":"Data!$G14","v":445},null,null,null,null,{"$f":"Data!$H14","v":18.284300000000002},null,null,null,null,null,null,null,null,{"$f":"Data!$G45","v":600},null,null,null,null,{"$f":"Data!$H45","v":37.325099999999999},null,null,null,null,null,null,null,null,{"$f":"IF(Data!$G76=\"\",\"\",Data!$G76)","v":755},null,null,null,null,{"$f":"IF(Data!$H76=\"\",\"\",Data!$H76)","v":5.6399999999999999E-2},null,null,null,null,null,null,null,null,{"$f":"IF(Data!$G107=\"\",\"\",Data!$G107)","v":""},null,null,null,null,{"$f":"IF(Data!$H107=\"\",\"\",Data!$H107)","v":""},null,null,null,null,null,null,null,null,{"$f":"IF(Data!$G138=\"\",\"\",Data!$G138)","v":""},null,null,null,null,{"$f":"IF(Data!$H138=\"\",\"\",Data!$H138)","v":""},null,null,null,null,null,null,null,null,{"$f":"IF(Data!$G169=\"\",\"\",Data!$G169)","v":""},null,null,null,null,{"$f":"IF(Data!$H169=\"\",\"\",Data!$H169)","v":""},null,null,null,null,null,null,null,null,{"$f":"IF(Data!$G200=\"\",\"\",Data!$G200)","v":""},null,null,null,null,{"$f":"IF(Data!$H200=\"\",\"\",Data!$H200)","v":""}]
[null,{"$f":"Data!$G15","v":450},null,null,null,null,{"$f":"Data!$H15","v":18.1922},null,null,null,null,null,null,null,null,{"$f":"Data!$G46","v":605},null,null,null,null,{"$f":"Data!$H46","v":78.079499999999996},null,null,null,null,null,null,null,null,{"$f":"IF(Data!$G77=\"\",\"\",Data!$G77)","v":760},null,null,null,null,{"$f":"IF(Data!$H77=\"\",\"\",Data!$H77)","v":4.9099999999999998E-2},null,null,null,null,null,null,null,null,{"$f":"IF(Data!$G108=\"\",\"\",Data!$G108)","v":""},null,null,null,null,{"$f":"IF(Data!$H108=\"\",\"\",Data!$H108)","v":""},null,null,null,null,null,null,null,null,{"$f":"IF(Data!$G139=\"\",\"\",Data!$G139)","v":""},null,null,null,null,{"$f":"IF(Data!$H139=\"\",\"\",Data!$H139)","v":""},null,null,null,null,null,null,null,null,{"$f":"IF(Data!$G170=\"\",\"\",Data!$G170)","v":""},null,null,null,null,{"$f":"IF(Data!$H170=\"\",\"\",Data!$H170)","v":""},null,null,null,null,null,null,null,null,{"$f":"IF(Data!$G201=\"\",\"\",Data!$G201)","v":""},null,null,null,null,{"$f":"IF(Data!$H201=\"\",\"\",Data!$H201)","v":""}]
[null,{"$f":"Data!$G16","v":455},null,null,null,null,{"$f":"Data!$H16","v":17.9373},null,null,null,null,null,null,null,null,{"$f":"Data!$G47","v":610},null,null,null,null,{"$f":"Data!$H47","v":135.84289999999999},null,null,null,null,null,null,null,null,{"$f":"IF(Data!$G78=\"\",\"\",Data!$G78)","v":765},null,null,null,null,{"$f":"IF(Data!$H78=\"\",\"\",Data!$H78)","v":0},null,null,null,null,null,null,null,null,{"$f":"IF(Data!$G109=\"\",\"\",Data!$G109)","v":""},null,null,null,null,{"$f":"IF(Data!$H109=\"\",\"\",Data!$H109)","v":""},null,null,null,null,null,null,null,null,{"$f":"IF(Data!$G140=\"\",\"\",Data!$G140)","v":""},null,null,null,null,{"$f":"IF(Data!$H140=\"\",\"\",Data!$H140)","v":""},null,null,null,null,null,null,null,null,{"$f":"IF(Data!$G171=\"\",\"\",Data!$G171)","v":""},null,null,null,null,{"$f":"IF(Data!$H171=\"\",\"\",Data!$H171)","v":""},null,null,null,null,null,null,null,null,{"$f":"IF(Data!$G202=\"\",\"\",Data!$G202)","v":""},null,null,null,null,{"$f":"IF(Data!$H202=\"\",\"\",Data!$H202)","v":""}]
[null,{"$f":"Data!$G17","v":460},null,null,null,null,{"$f":"Data!$H17","v":16.9191},null,null,null,null,null,null,null,null,{"$f":"Data!$G48","v":615},null,null,null,null,{"$f":"Data!$H48","v":105.47709999999999},null,null,null,null,null,null,null,null,{"$f":"IF(Data!$G79=\"\",\"\",Data!$G79)","v":770},null,null,null,null,{"$f":"IF(Data!$H79=\"\",\"\",Data!$H79)","v":0},null,null,null,null,null,null,null,null,{"$f":"IF(Data!$G110=\"\",\"\",Data!$G110)","v":""},null,null,null,null,{"$f":"IF(Data!$H110=\"\",\"\",Data!$H110)","v":""},null,null,null,null,null,null,null,null,{"$f":"IF(Data!$G141=\"\",\"\",Data!$G141)","v":""},null,null,null,null,{"$f":"IF(Data!$H141=\"\",\"\",Data!$H141)","v":""},null,null,null,null,null,null,null,null,{"$f":"IF(Data!$G172=\"\",\"\",Data!$G172)","v":""},null,null,null,null,{"$f":"IF(Data!$H172=\"\",\"\",Data!$H172)","v":""},null,null,null,null,null,null,null,null,{"$f":"IF(Data!$G203=\"\",\"\",Data!$G203)","v":""},null,null,null,null,{"$f":"IF(Data!$H203=\"\",\"\",Data!$H203)","v":""}]
[null,{"$f":"Data!$G18","v":465},null,null,null,null,{"$f":"Data!$H18","v":15.5221},null,null,null,null,null,null,null,null,{"$f":"Data!$G49","v":620},null,null,null,null,{"$f":"Data!$H49","v":55.517299999999999},null,null,null,null,null,null,null,null,{"$f":"IF(Data!$G80=\"\",\"\",Data!$G80)","v":775},null,null,null,null,{"$f":"IF(Data!$H80=\"\",\"\",Data!$H80)","v":0.10829999999999999},null,null,null,null,null,null,null,null,{"$f":"IF(Data!$G111=\"\",\"\",Data!$G111)","v":""},null,null,null,null,{"$f":"IF(Data!$H111=\"\",\"\",Data!$H111)","v":""},null,null,null,null,null,null,null,null,{"$f":"IF(Data!$G142=\"\",\"\",Data!$G142)","v":""},null,null,null,null,{"$f":"IF(Data!$H142=\"\",\"\",Data!$H142)","v":""},null,null,null,null,null,null,null,null,{"$f":"IF(Data!$G173=\"\",\"\",Data!$G173)","v":""},null,null,null,null,{"$f":"IF(Data!$H173=\"\",\"\",Data!$H173)","v":""},null,null,null,null,null,null,null,null,{"$f":"IF(Data!$G204=\"\",\"\",Data!$G204)","v":""},null,null,null,null,{"$f":"IF(Data!$H204=\"\",\"\",Data!$H204)","v":""}]
[null,{"$f":"Data!$G19","v":470},null,null,null,null,{"$f":"Data!$H19","v":14.143000000000001},null,null,null,null,null,null,null,null,{"$f":"Data!$G50","v":625},null,null,null,null,{"$f":"Data!$H50","v":43.192900000000002},null,null,null,null,null,null,null,null,{"$f":"IF(Data!$G81=\"\",\"\",Data!$G81)","v":780},null,null,null,null,{"$f":"IF(Data!$H81=\"\",\"\",Data!$H81)","v":0},null,null,null,null,null,null,null,null,{"$f":"IF(Data!$G112=\"\",\"\",Data!$G112)","v":""},null,null,null,null,{"$f":"IF(Data!$H112=\"\",\"\",Data!$H112)","v":""},null,null,null,null,null,null,null,null,{"$f":"IF(Data!$G143=\"\",\"\",Data!$G143)","v":""},null,null,null,null,{"$f":"IF(Data!$H143=\"\",\"\",Data!$H143)","v":""},null,null,null,null,null,null,null,null,{"$f":"IF(Data!$G174=\"\",\"\",Data!$G174)","v":""},null,null,null,null,{"$f":"IF(Data!$H174=\"\",\"\",Data!$H174)","v":""},null,null,null,null,null,null,null,null,{"$f":"IF(Data!$G205=\"\",\"\",Data!$G205)","v":""},null,null,null,null,{"$f":"IF(Data!$H205=\"\",\"\",Data!$H205)","v":""}]
[null,{"$f":"Data!$G20","v":475},null,null,null,null,{"$f":"Data!$H20","v":14.642799999999999},null,null,null,null,null,null,null,null,{"$f":"Data!$G51","v":630},null,null,null,null,{"$f":"Data!$H51","v":33.598399999999998},null,null,null,null,null,null,null,null,{"$f":"IF(Data!$G82=\"\",\"\",Data!$G82)","v":""},null,null,null,null,{"$f":"IF(Data!$H82=\"\",\"\",Data!$H82)","v":""},null,null,null,null,null,null,null,null,{"$f":"IF(Data!$G113=\"\",\"\",Data!$G113)","v":""},null,null,null,null,{"$f":"IF(Data!$H113=\"\",\"\",Data!$H113)","v":""},null,null,null,null,null,null,null,null,{"$f":"IF(Data!$G144=\"\",\"\",Data!$G144)","v":""},null,null,null,null,{"$f":"IF(Data!$H144=\"\",\"\",Data!$H144)","v":""},null,null,null,null,null,null,null,null,{"$f":"IF(Data!$G175=\"\",\"\",Data!$G175)","v":""},null,null,null,null,{"$f":"IF(Data!$H175=\"\",\"\",Data!$H175)","v":""},null,null,null,null,null,null,null,null,{"$f":"IF(Data!$G206=\"\",\"\",Data!$G206)","v":""},null,null,null,null,{"$f":"IF(Data!$H206=\"\",\"\",Data!$H206)","v":""}]
[null,{"$f":"Data!$G21","v":480},null,null,null,null,{"$f":"Data!$H21","v":24.472799999999999},null,null,null,null,null,null,null,null,{"$f":"Data!$G52","v":635},null,null,null,null,{"$f":"Data!$H52","v":18.711099999999998},null,null,null,null,null,null,null,null,{"$f":"IF(Data!$G83=\"\",\"\",Data!$G83)","v":""},null,null,null,null,{"$f":"IF(Data!$H83=\"\",\"\",Data!$H83)","v":""},null,null,null,null,null,null,null,null,{"$f":"IF(Data!$G114=\"\",\"\",Data!$G114)","v":""},null,null,null,null,{"$f":"IF(Data!$H114=\"\",\"\",Data!$H114)","v":""},null,null,null,null,null,null,null,null,{"$f":"IF(Data!$G145=\"\",\"\",Data!$G145)","v":""},null,null,null,null,{"$f":"IF(Data!$H145=\"\",\"\",Data!$H145)","v":""},null,null,null,null,null,null,null,null,{"$f":"IF(Data!$G176=\"\",\"\",Data!$G176)","v":""},null,null,null,null,{"$f":"IF(Data!$H176=\"\",\"\",Data!$H176)","v":""},null,null,null,null,null,null,null,null,{"$f":"IF(Data!$G207=\"\",\"\",Data!$G207)","v":""},null,null,null,null,{"$f":"IF(Data!$H207=\"\",\"\",Data!$H207)","v":""}]
[null,{"$f":"Data!$G22","v":485},null,null,null,null,{"$f":"Data!$H22","v":39.417099999999998},null,null,null,null,null,null,null,null,{"$f":"Data!$G53","v":640},null,null,null,null,{"$f":"Data!$H53","v":11.090999999999999},null,null,null,null,null,null,null,null,{"$f":"IF(Data!$G84=\"\",\"\",Data!$G84)","v":""},null,null,null,null,{"$f":"IF(Data!$H84=\"\",\"\",Data!$H84)","v":""},null,null,null,null,null,null,null,null,{"$f":"IF(Data!$G115=\"\",\"\",Data!$G115)","v":""},null,null,null,null,{"$f":"IF(Data!$H115=\"\",\"\",Data!$H115)","v":""},null,null,null,null,null,null,null,null,{"$f":"IF(Data!$G146=\"\",\"\",Data!$G146)","v":""},null,null,null,null,{"$f":"IF(Data!$H146=\"\",\"\",Data!$H146)","v":""},null,null,null,null,null,null,null,null,{"$f":"IF(Data!$G177=\"\",\"\",Data!$G177)","v":""},null,null,null,null,{"$f":"IF(Data!$H177=\"\",\"\",Data!$H177)","v":""},null,null,null,null,null,null,null,null,{"$f":"IF(Data!$G208=\"\",\"\",Data!$G208)","v":""},null,null,null,null,{"$f":"IF(Data!$H208=\"\",\"\",Data!$H208)","v":""}]
[null,{"$f":"Data!$G23","v":490},null,null,null,null,{"$f":"Data!$H23","v":36.798900000000003},null,null,null,null,null,null,null,null,{"$f":"Data!$G54","v":645},null,null,null,null,{"$f":"Data!$H54","v":10.468299999999999},null,null,null,null,null,null,null,null,{"$f":"IF(Data!$G85=\"\",\"\",Data!$G85)","v":""},null,null,null,null,{"$f":"IF(Data!$H85=\"\",\"\",Data!$H85)","v":""},null,null,null,null,null,null,null,null,{"$f":"IF(Data!$G116=\"\",\"\",Data!$G116)","v":""},null,null,null,null,{"$f":"IF(Data!$H116=\"\",\"\",Data!$H116)","v":""},null,null,null,null,null,null,null,null,{"$f":"IF(Data!$G147=\"\",\"\",Data!$G147)","v":""},null,null,null,null,{"$f":"IF(Data!$H147=\"\",\"\",Data!$H147)","v":""},null,null,null,null,null,null,null,null,{"$f":"IF(Data!$G178=\"\",\"\",Data!$G178)","v":""},null,null,null,null,{"$f":"IF(Data!$H178=\"\",\"\",Data!$H178)","v":""},null,null,null,null,null,null,null,null,{"$f":"IF(Data!$G209=\"\",\"\",Data!$G209)","v":""},null,null,null,null,{"$f":"IF(Data!$H209=\"\",\"\",Data!$H209)","v":""}]
[null,{"$f":"Data!$G24","v":495},null,null,null,null,{"$f":"Data!$H24","v":23.702999999999999},null,null,null,null,null,null,null,null,{"$f":"Data!$G55","v":650},null,null,null,null,{"$f":"Data!$H55","v":11.261100000000001},null,null,null,null,null,null,null,null,{"$f":"IF(Data!$G86=\"\",\"\",Data!$G86)","v":""},null,null,null,null,{"$f":"IF(Data!$H86=\"\",\"\",Data!$H86)","v":""},null,null,null,null,null,null,null,null,{"$f":"IF(Data!$G117=\"\",\"\",Data!$G117)","v":""},null,null,null,null,{"$f":"IF(Data!$H117=\"\",\"\",Data!$H117)","v":""},null,null,null,null,null,null,null,null,{"$f":"IF(Data!$G148=\"\",\"\",Data!$G148)","v":""},null,null,null,null,{"$f":"IF(Data!$H148=\"\",\"\",Data!$H148)","v":""},null,null,null,null,null,null,null,null,{"$f":"IF(Data!$G179=\"\",\"\",Data!$G179)","v":""},null,null,null,null,{"$f":"IF(Data!$H179=\"\",\"\",Data!$H179)","v":""},null,null,null,null,null,null,null,null,{"$f":"IF(Data!$G210=\"\",\"\",Data!$G210)","v":""},null,null,null,null,{"$f":"IF(Data!$H210=\"\",\"\",Data!$H210)","v":""}]
[null,{"$f":"Data!$G25","v":500},null,null,null,null,{"$f":"Data!$H25","v":13.5647},null,null,null,null,null,null,null,null,{"$f":"Data!$G56","v":655},null,null,null,null,{"$f":"Data!$H56","v":10.1099},null,null,null,null,null,null,null,null,{"$f":"IF(Data!$G87=\"\",\"\",Data!$G87)","v":""},null,null,null,null,{"$f":"IF(Data!$H87=\"\",\"\",Data!$H87)","v":""},null,null,null,null,null,null,null,null,{"$f":"IF(Data!$G118=\"\",\"\",Data!$G118)","v":""},null,null,null,null,{"$f":"IF(Data!$H118=\"\",\"\",Data!$H118)","v":""},null,null,null,null,null,null,null,null,{"$f":"IF(Data!$G149=\"\",\"\",Data!$G149)","v":""},null,null,null,null,{"$f":"IF(Data!$H149=\"\",\"\",Data!$H149)","v":""},null,null,null,null,null,null,null,null,{"$f":"IF(Data!$G180=\"\",\"\",Data!$G180)","v":""},null,null,null,null,{"$f":"IF(Data!$H180=\"\",\"\",Data!$H180)","v":""},null,null,null,null,null,null,null,null,{"$f":"IF(Data!$G211=\"\",\"\",Data!$G211)","v":""},null,null,null,null,{"$f":"IF(Data!$H211=\"\",\"\",Data!$H211)","v":""}]
[null,{"$f":"Data!$G26","v":505},null,null,null,null,{"$f":"Data!$H26","v":8.2264999999999997},null,null,null,null,null,null,null,null,{"$f":"Data!$G57","v":660},null,null,null,null,{"$f":"Data!$H57","v":8.9038000000000004},null,null,null,null,null,null,null,null,{"$f":"IF(Data!$G88=\"\",\"\",Data!$G88)","v":""},null,null,null,null,{"$f":"IF(Data!$H88=\"\",\"\",Data!$H88)","v":""},null,null,null,null,null,null,null,null,{"$f":"IF(Data!$G119=\"\",\"\",Data!$G119)","v":""},null,null,null,null,{"$f":"IF(Data!$H119=\"\",\"\",Data!$H119)","v":""},null,null,null,null,null,null,null,null,{"$f":"IF(Data!$G150=\"\",\"\",Data!$G150)","v":""},null,null,null,null,{"$f":"IF(Data!$H150=\"\",\"\",Data!$H150)","v":""},null,null,null,null,null,null,null,null,{"$f":"IF(Data!$G181=\"\",\"\",Data!$G181)","v":""},null,null,null,null,{"$f":"IF(Data!$H181=\"\",\"\",Data!$H181)","v":""},null,null,null,null,null,null,null,null,{"$f":"IF(Data!$G212=\"\",\"\",Data!$G212)","v":""},null,null,null,null,{"$f":"IF(Data!$H212=\"\",\"\",Data!$H212)","v":""}]
[null,{"$f":"Data!$G27","v":510},null,null,null,null,{"$f":"Data!$H27","v":6.1430999999999996},null,null,null,null,null,null,null,null,{"$f":"Data!$G58","v":665},null,null,null,null,{"$f":"Data!$H58","v":7.5664999999999996},null,null,null,null,null,null,null,null,{"$f":"IF(Data!$G89=\"\",\"\",Data!$G89)","v":""},null,null,null,null,{"$f":"IF(Data!$H89=\"\",\"\",Data!$H89)","v":""},null,null,null,null,null,null,null,null,{"$f":"IF(Data!$G120=\"\",\"\",Data!$G120)","v":""},null,null,null,null,{"$f":"IF(Data!$H120=\"\",\"\",Data!$H120)","v":""},null,null,null,null,null,null,null,null,{"$f":"IF(Data!$G151=\"\",\"\",Data!$G151)","v":""},null,null,null,null,{"$f":"IF(Data!$H151=\"\",\"\",Data!$H151)","v":""},null,null,null,null,null,null,null,null,{"$f":"IF(Data!$G182=\"\",\"\",Data!$G182)","v":""},null,null,null,null,{"$f":"IF(Data!$H182=\"\",\"\",Data!$H182)","v":""},null,null,null,null,null,null,null,null,{"$f":"IF(Data!$G213=\"\",\"\",Data!$G213)","v":""},null,null,null,null,{"$f":"IF(Data!$H213=\"\",\"\",Data!$H213)","v":""}]
[null,{"$f":"Data!$G28","v":515},null,null,null,null,{"$f":"Data!$H28","v":5.6165000000000003},null,null,null,null,null,null,null,null,{"$f":"Data!$G59","v":670},null,null,null,null,{"$f":"Data!$H59","v":5.6665999999999999},null,null,null,null,null,null,null,null,{"$f":"IF(Data!$G90=\"\",\"\",Data!$G90)","v":""},null,null,null,null,{"$f":"IF(Data!$H90=\"\",\"\",Data!$H90)","v":""},null,null,null,null,null,null,null,null,{"$f":"IF(Data!$G121=\"\",\"\",Data!$G121)","v":""},null,null,null,null,{"$f":"IF(Data!$H121=\"\",\"\",Data!$H121)","v":""},null,null,null,null,null,null,null,null,{"$f":"IF(Data!$G152=\"\",\"\",Data!$G152)","v":""},null,null,null,null,{"$f":"IF(Data!$H152=\"\",\"\",Data!$H152)","v":""},null,null,null,null,null,null,null,null,{"$f":"IF(Data!$G183=\"\",\"\",Data!$G183)","v":""},null,null,null,null,{"$f":"IF(Data!$H183=\"\",\"\",Data!$H183)","v":""},null,null,null,null,null,null,null,null,{"$f":"IF(Data!$G214=\"\",\"\",Data!$G214)","v":""},null,null,null,null,{"$f":"IF(Data!$H214=\"\",\"\",Data!$H214)","v":""}]
[null,{"$f":"Data!$G29","v":520},null,null,null,null,{"$f":"Data!$H29","v":5.7843},null,null,null,null,null,null,null,null,{"$f":"Data!$G60","v":675},null,null,null,null,{"$f":"Data!$H60","v":5.3181000000000003},null,null,null,null,null,null,null,null,{"$f":"IF(Data!$G91=\"\",\"\",Data!$G91)","v":""},null,null,null,null,{"$f":"IF(Data!$H91=\"\",\"\",Data!$H91)","v":""},null,null,null,null,null,null,null,null,{"$f":"IF(Data!$G122=\"\",\"\",Data!$G122)","v":""},null,null,null,null,{"$f":"IF(Data!$H122=\"\",\"\",Data!$H122)","v":""},null,null,null,null,null,null,null,null,{"$f":"IF(Data!$G153=\"\",\"\",Data!$G153)","v":""},null,null,null,null,{"$f":"IF(Data!$H153=\"\",\"\",Data!$H153)","v":""},null,null,null,null,null,null,null,null,{"$f":"IF(Data!$G184=\"\",\"\",Data!$G184)","v":""},null,null,null,null,{"$f":"IF(Data!$H184=\"\",\"\",Data!$H184)","v":""},null,null,null,null,null,null,null,null,{"$f":"IF(Data!$G215=\"\",\"\",Data!$G215)","v":""},null,null,null,null,{"$f":"IF(Data!$H215=\"\",\"\",Data!$H215)","v":""}]
[null,{"$f":"Data!$G30","v":525},null,null,null,null,{"$f":"Data!$H30","v":7.9572000000000003},null,null,null,null,null,null,null,null,{"$f":"Data!$G61","v":680},null,null,null,null,{"$f":"Data!$H61","v":5.8703000000000003},null,null,null,null,null,null,null,null,{"$f":"IF(Data!$G92=\"\",\"\",Data!$G92)","v":""},null,null,null,null,{"$f":"IF(Data!$H92=\"\",\"\",Data!$H92)","v":""},null,null,null,null,null,null,null,null,{"$f":"IF(Data!$G123=\"\",\"\",Data!$G123)","v":""},null,null,null,null,{"$f":"IF(Data!$H123=\"\",\"\",Data!$H123)","v":""},null,null,null,null,null,null,null,null,{"$f":"IF(Data!$G154=\"\",\"\",Data!$G154)","v":""},null,null,null,null,{"$f":"IF(Data!$H154=\"\",\"\",Data!$H154)","v":""},null,null,null,null,null,null,null,null,{"$f":"IF(Data!$G185=\"\",\"\",Data!$G185)","v":""},null,null,null,null,{"$f":"IF(Data!$H185=\"\",\"\",Data!$H185)","v":""},null,null,null,null,null,null,null,null,{"$f":"IF(Data!$G216=\"\",\"\",Data!$G216)","v":""},null,null,null,null,{"$f":"IF(Data!$H216=\"\",\"\",Data!$H216)","v":""}]
[null,{"$f":"Data!$G31","v":530},null,null,null,null,{"$f":"Data!$H31","v":17.520900000000001},null,null,null,null,null,null,null,null,{"$f":"Data!$G62","v":685},null,null,null,null,{"$f":"Data!$H62","v":6.3794000000000004},null,null,null,null,null,null,null,null,{"$f":"IF(Data!$G93=\"\",\"\",Data!$G93)","v":""},null,null,null,null,{"$f":"IF(Data!$H93=\"\",\"\",Data!$H93)","v":""},null,null,null,null,null,null,null,null,{"$f":"IF(Data!$G124=\"\",\"\",Data!$G124)","v":""},null,null,null,null,{"$f":"IF(Data!$H124=\"\",\"\",Data!$H124)","v":""},null,null,null,null,null,null,null,null,{"$f":"IF(Data!$G155=\"\",\"\",Data!$G155)","v":""},null,null,null,null,{"$f":"IF(Data!$H155=\"\",\"\",Data!$H155)","v":""},null,null,null,null,null,null,null,null,{"$f":"IF(Data!$G186=\"\",\"\",Data!$G186)","v":""},null,null,null,null,{"$f":"IF(Data!$H186=\"\",\"\",Data!$H186)","v":""},null,null,null,null,null,null,null,null,{"$f":"IF(Data!$G217=\"\",\"\",Data!$G217)","v":""},null,null,null,null,{"$f":"IF(Data!$H217=\"\",\"\",Data!$H217)","v":""}]
[]
[]
[]
[]
[]
[]
[]
[]
[]
[]
[{"$f":"'Protokoll 1 (5nm)'!A54:AA54","v":"Firma"}]
[{"$f":"'Protokoll 1 (5nm)'!A55:AA55","v":"Adresse"}]
[{"$f":"'Protokoll 1 (5nm)'!A56:AA56","v":"PLZ  Ort"}]
[]
[{"$f":"'Protokoll 1 (5nm)'!A58:O58","v":"Prüfort,"},null,null,null,null,null,null,null,null,null,null,null,null,null,null,{"$f":"'Protokoll 1 (5nm)'!P58:AA58","v":"Datum"},null,null,null,null,null,null,null,null,null,null,null,null,null,null,null,null,null,null,null,null,null,null,null,null,null,null,null,null,null,null,null,null,null,null,null,null,null,null,null,null,null,null,null,null,null,null,null,{"$f":"'Protokoll 1 (5nm)'!BL58:CF58","v":"Vorname, Nachname Prüfer"},null,null,null,null,null,null,null,null,null,null,null,null,null,null,null,null,null,null,null,null,{"$f":"'Protokoll 1 (5nm)'!CG58:CX58","v":"Telefonnummer"}]

{"sheet":"Protokoll 3","index":2,"n_rows":64,"n_cols":85,"rows_kept":64,"cut":false,"hidden":false,"merged":[[60,0,60,26],[61,0,61,26],[63,0,63,14],[63,15,63,26],[0,0,1,53],[3,0,3,12],[3,13,3,58],[4,13,4,58],[5,13,5,58],[59,0,59,26],[63,63,63,83],[3,84,3,99],[4,62,4,83],[4,84,4,99],[5,84,5,99],[63,84,63,101],[5,62,5,83],[3,62,3,83]]}
[{"$f":"IF(Data!$AE$2=\"DE\",\"Messprotokoll\",IF(Data!$AE$2=\"UK\",\"Measurement protocol\",IF(Data!$AE$2=\"FR\",\"Rapport de mesure\",\"Language Error\")))","v":"Messprotokoll"}]
[]
[]
[{"$f":"IF(Data!$AE$2 = \"DE\", \"Prüfling:\", IF(Data!$AE$2 = \"UK\",\"Test object:\",IF(Data!$AE$2=\"FR\",\"Objet testé:\",\"Language Error\")))","v":"Prüfling:"},null,null,null,null,null,null,null,null,null,null,null,null,{"$f":"'Protokoll 1 (5nm)'!N4:BG4","v":"Philips"},null,null,null,null,null,null,null,null,null,null,null,null,null,null,null,null,null,null,null,null,null,null,null,null,null,null,null,null,null,null,null,null,null,null,null,null,null,null,null,null,null,null,null,null,null,null,null,null,{"$f":"IF(Data!$AE$2=\"DE\",\"Messdatei:\",IF(Data!$AE$2=\"UK\",\"Measurement file:\",IF(Data!$AE$2=\"FR\",\"Fichier de mesure:\",\"Language Error\")))","v":"Messdatei:"},null,null,null,null,null,null,null,null,null,null,null,null,null,null,null,null,null,null,null,null,null,{"$f":"Data!Q18","v":"Test-M.CSV"}]
[null,null,null,null,null,null,null,null,null,null,null,null,null,{"$f":"'Protokoll 1 (5nm)'!N5:BG5","v":"Master TL-D Super 80"},null,null,null,null,null,null,null,null,null,null,null,null,null,null,null,null,null,null,null,null,null,null,null,null,null,null,null,null,null,null,null,null,null,null,null,null,null,null,null,null,null,null,null,null,null,null,null,null,{"$f":"IF(Data!$AE$2=\"DE\",\"Datum der Messung:\",IF(Data!$AE$2=\"UK\",\"Date of measurement:\",IF(Data!$AE$2=\"FR\",\"Date de mesure:\",\"Language Error\")))","v":"Datum der Messung:"},null,null,null,null,null,null,null,null,null,null,null,null,null,null,null,null,null,null,null,null,null,{"$f":"Data!Q23","v":"03.03.2017"}]
[null,null,null,null,null,null,null,null,null,null,null,null,null,{"$f":"'Protokoll 1 (5nm)'!N6:BG6","v":"36W/840"},null,null,null,null,null,null,null,null,null,null,null,null,null,null,null,null,null,null,null,null,null,null,null,null,null,null,null,null,null,null,null,null,null,null,null,null,null,null,null,null,null,null,null,null,null,null,null,null,{"$f":"IF(Data!$AE$2=\"DE\",\"Uhrzeit der Messung:\",IF(Data!$AE$2=\"UK\",\"Time of measurement:\",IF(Data!$AE$2=\"FR\",\"Heure de mesure:\",\"Language Error\")))","v":"Uhrzeit der Messung:"},null,null,null,null,null,null,null,null,null,null,null,null,null,null,null,null,null,null,null,null,null,{"$f":"Data!Q21","v":"08:17:53"}]
[]
[]
[]
[]
[]
[]
[]
[]
[]
[]
[]
[]
[]
[]
[]
[]
[]
[]
[]
[]
[]
[]
[]
[]
[]
[]
[]
[]
[]
[]
[]
[]
[]
[]
[]
[]
[]
[]
[]
[]
[]
[]
[]
[]
[]
[]
[]
[]
[]
[]
[]
[]
[]
[{"$f":"'Protokoll 1 (5nm)'!A54:AA54","v":"Firma"}]
[{"$f":"'Protokoll 1 (5nm)'!A55:AA55","v":"Adresse"}]
[{"$f":"'Protokoll 1 (5nm)'!A56:AA56","v":"PLZ  Ort"}]
[]
[{"$f":"'Protokoll 1 (5nm)'!A58:O58","v":"Prüfort,"},null,null,null,null,null,null,null,null,null,null,null,null,null,null,{"$f":"'Protokoll 1 (5nm)'!P58:AA58","v":"Datum"},null,null,null,null,null,null,null,null,null,null,null,null,null,null,null,null,null,null,null,null,null,null,null,null,null,null,null,null,null,null,null,null,null,null,null,null,null,null,null,null,null,null,null,null,null,null,null,{"$f":"'Protokoll 1 (5nm)'!BL58:CF58","v":"Vorname, Nachname Prüfer"},null,null,null,null,null,null,null,null,null,null,null,null,null,null,null,null,null,null,null,null,{"$f":"'Protokoll 1 (5nm)'!CG58:CX58","v":"Telefonnummer"}]

{"sheet":"Protokoll TM30","index":3,"n_rows":58,"n_cols":85,"rows_kept":58,"cut":false,"hidden":false,"merged":[[0,0,1,53],[3,84,3,99],[4,62,4,83],[4,84,4,99],[5,84,5,99],[57,63,57,83],[57,84,57,101],[5,62,5,83],[3,0,3,12],[3,13,3,58],[4,13,4,58],[5,13,5,58],[3,62,3,83],[53,0,53,26],[54,0,54,26],[55,0,55,26],[57,0,57,14],[57,15,57,26]]}
[{"$f":"IF(Data!$AE$2=\"DE\",\"Messprotokoll\",IF(Data!$AE$2=\"UK\",\"Measurement protocol\",IF(Data!$AE$2=\"FR\",\"Rapport de mesure\",\"Language Error\")))","v":"Messprotokoll"}]
[]
[]
[{"$f":"IF(Data!$AE$2 = \"DE\", \"Prüfling:\", IF(Data!$AE$2 = \"UK\",\"Test object:\",IF(Data!$AE$2=\"FR\",\"Objet testé:\",\"Language Error\")))","v":"Prüfling:"},null,null,null,null,null,null,null,null,null,null,null,null,{"$f":"'Protokoll 1 (5nm)'!N4:BG4","v":"Philips"},null,null,null,null,null,null,null,null,null,null,null,null,null,null,null,null,null,null,null,null,null,null,null,null,null,null,null,null,null,null,null,null,null,null,null,null,null,null,null,null,null,null,null,null,null,null,null,null,{"$f":"IF(Data!$AE$2=\"DE\",\"Messdatei:\",IF(Data!$AE$2=\"UK\",\"Measurement file:\",IF(Data!$AE$2=\"FR\",\"Fichier de mesure:\",\"Language Error\")))","v":"Messdatei:"},null,null,null,null,null,null,null,null,null,null,null,null,null,null,null,null,null,null,null,null,null,{"$f":"Data!Q18","v":"Test-M.CSV"}]
[null,null,null,null,null,null,null,null,null,null,null,null,null,{"$f":"'Protokoll 1 (5nm)'!N5:BG5","v":"Master TL-D Super 80"},null,null,null,null,null,null,null,null,null,null,null,null,null,null,null,null,null,null,null,null,null,null,null,null,null,null,null,null,null,null,null,null,null,null,null,null,null,null,null,null,null,null,null,null,null,null,null,null,{"$f":"IF(Data!$AE$2=\"DE\",\"Datum der Messung:\",IF(Data!$AE$2=\"UK\",\"Date of measurement:\",IF(Data!$AE$2=\"FR\",\"Date de mesure:\",\"Language Error\")))","v":"Datum der Messung:"},null,null,null,null,null,null,null,null,null,null,null,null,null,null,null,null,null,null,null,null,null,{"$f":"Data!Q23","v":"03.03.2017"}]
[null,null,null,null,null,null,null,null,null,null,null,null,null,{"$f":"'Protokoll 1 (5nm)'!N6:BG6","v":"36W/840"},null,null,null,null,null,null,null,null,null,null,null,null,null,null,null,null,null,null,null,null,null,null,null,null,null,null,null,null,null,null,null,null,null,null,null,null,null,null,null,null,null,null,null,null,null,null,null,null,{"$f":"IF(Data!$AE$2=\"DE\",\"Uhrzeit der Messung:\",IF(Data!$AE$2=\"UK\",\"Time of measurement:\",IF(Data!$AE$2=\"FR\",\"Heure de mesure:\",\"Language Error\")))","v":"Uhrzeit der Messung:"},null,null,null,null,null,null,null,null,null,null,null,null,null,null,null,null,null,null,null,null,null,{"$f":"Data!Q21","v":"08:17:53"}]
[]
[]
[]
[]
[]
[]
[]
[]
[]
[]
[]
[]
[]
[]
[]
[]
[]
[]
[]
[]
[]
[]
[]
[]
[]
[]
[]
[]
[]
[]
[]
[]
[]
[]
[]
[]
[]
[]
[]
[]
[]
[]
[]
[]
[]
[]
[]
[{"$f":"'Protokoll 1 (5nm)'!A54:AA54","v":"Firma"}]
[{"$f":"'Protokoll 1 (5nm)'!A55:AA55","v":"Adresse"}]
[{"$f":"'Protokoll 1 (5nm)'!A56:AA56","v":"PLZ  Ort"}]
[]
[{"$f":"'Protokoll 1 (5nm)'!A58:O58","v":"Prüfort,"},null,null,null,null,null,null,null,null,null,null,null,null,null,null,{"$f":"'Protokoll 1 (5nm)'!P58:AA58","v":"Datum"},null,null,null,null,null,null,null,null,null,null,null,null,null,null,null,null,null,null,null,null,null,null,null,null,null,null,null,null,null,null,null,null,null,null,null,null,null,null,null,null,null,null,null,null,null,null,null,{"$f":"'Protokoll 1 (5nm)'!BL58:CF58","v":"Vorname, Nachname Prüfer"},null,null,null,null,null,null,null,null,null,null,null,null,null,null,null,null,null,null,null,null,{"$f":"'Protokoll 1 (5nm)'!CG58:CX58","v":"Telefonnummer"}]

{"sheet":"Referenzvergleich","index":4,"n_rows":55,"n_cols":92,"rows_kept":55,"cut":false,"hidden":false,"merged":[[24,91,24,101],[26,36,26,65],[26,66,26,77],[30,78,30,90],[30,91,30,101],[32,91,32,101],[34,66,34,77],[35,66,35,77],[24,66,24,77],[25,66,25,77],[34,36,34,65],[35,36,35,65],[25,36,25,65],[29,36,29,65],[30,36,30,65],[30,66,30,77],[29,91,29,101],[29,66,29,77],[34,91,34,101],[35,91,35,101],[26,78,26,90],[26,91,26,101],[27,36,27,65],[27,66,27,77],[27,78,27,90],[27,91,27,101],[25,91,25,101],[36,6,36,15],[30,16,30,28],[31,16,31,28],[32,16,32,28],[35,1,35,5],[36,1,36,5],[30,1,30,5],[29,29,29,34],[30,29,30,34],[32,78,32,90],[29,1,29,5],[28,1,28,5],[33,1,33,5],[34,1,34,5],[31,1,31,5],[32,1,32,5],[37,1,37,5],[38,1,38,5],[38,6,38,15],[39,6,39,15],[40,6,40,15],[54,0,54,14],[54,15,54,26],[39,29,39,34],[40,29,40,34],[38,29,38,34],[43,1,43,5],[43,6,43,15],[43,16,43,28],[43,29,43,34],[42,1,42,5],[42,6,42,15],[42,16,42,28],[42,29,42,34],[54,63,54,83],[37,66,37,77],[37,78,37,90],[27,1,27,5],[26,29,26,34],[32,6,32,15],[33,6,33,15],[34,6,34,15],[26,16,26,28],[27,16,27,28],[28,16,28,28],[29,16,29,28],[37,6,37,15],[26,6,26,15],[27,6,27,15],[28,6,28,15],[29,6,29,15],[30,6,30,15],[31,6,31,15],[33,29,33,34],[34,29,34,34],[39,1,39,5],[40,1,40,5],[26,1,26,5],[24,6,24,15],[24,29,24,34],[35,29,35,34],[31,29,31,34],[32,29,32,34],[32,36,32,65],[32,66,32,77],[25,16,25,28],[25,6,25,15],[25,29,25,34],[35,6,35,15],[54,84,54,101],[0,0,1,53],[34,16,34,28],[35,16,35,28],[36,16,36,28],[37,16,37,28],[38,16,38,28],[39,16,39,28],[40,16,40,28],[24,78,24,90],[25,78,25,90],[29,78,29,90],[34,78,34,90],[35,78,35,90],[24,36,24,65],[33,16,33,28],[36,29,36,34],[37,29,37,34],[28,29,28,34],[24,1,24,5],[24,16,24,28],[37,36,37,65],[3,13,3,58],[4,13,4,58],[8,62,8,83],[8,84,8,99],[3,0,3,12],[50,0,50,26],[51,0,51,26],[52,0,52,26],[3,62,3,83],[3,84,3,99],[4,62,4,83],[4,84,4,99],[5,62,5,83],[5,84,5,99],[6,62,6,83],[6,84,6,99],[7,62,7,83],[7,84,7,99],[37,91,37,101],[38,36,38,65],[38,66,38,77],[38,78,38,90],[38,91,38,101],[5,13,5,58],[27,29,27,34],[25,1,25,5]]}
[{"$f":"IF(Data!$AE$2=\"DE\",\"Messprotokoll\",IF(Data!$AE$2=\"UK\",\"Measurement protocol\",IF(Data!$AE$2=\"FR\",\"Rapport de mesure\",\"Language Error\")))","v":"Messprotokoll"}]
[]
[]
[{"$f":"IF(Data!$AE$2 = \"DE\", \"Prüfling:\", IF(Data!$AE$2 = \"UK\",\"Test object:\",IF(Data!$AE$2=\"FR\",\"Objet testé:\",\"Language Error\")))","v":"Prüfling:"},null,null,null,null,null,null,null,null,null,null,null,null,{"$f":"'Protokoll 1 (5nm)'!N4:BG4","v":"Philips"},null,null,null,null,null,null,null,null,null,null,null,null,null,null,null,null,null,null,null,null,null,null,null,null,null,null,null,null,null,null,null,null,null,null,null,null,null,null,null,null,null,null,null,null,null,null,null,null,{"$f":"IF(Data!$AE$2=\"DE\",\"Messdatei:\",IF(Data!$AE$2=\"UK\",\"Measurement file:\",IF(Data!$AE$2=\"FR\",\"Fichier de mesure:\",\"Language Error\")))","v":"Messdatei:"},null,null,null,null,null,null,null,null,null,null,null,null,null,null,null,null,null,null,null,null,null,{"$f":"Data!Q18","v":"Test-M.CSV"}]
[null,null,null,null,null,null,null,null,null,null,null,null,null,{"$f":"'Protokoll 1 (5nm)'!N5:BG5","v":"Master TL-D Super 80"},null,null,null,null,null,null,null,null,null,null,null,null,null,null,null,null,null,null,null,null,null,null,null,null,null,null,null,null,null,null,null,null,null,null,null,null,null,null,null,null,null,null,null,null,null,null,null,null,{"$f":"IF(Data!$AE$2=\"DE\",\"Datum der Messung:\",IF(Data!$AE$2=\"UK\",\"Date of measurement:\",IF(Data!$AE$2=\"FR\",\"Date de mesure:\",\"Language Error\")))","v":"Datum der Messung:"},null,null,null,null,null,null,null,null,null,null,null,null,null,null,null,null,null,null,null,null,null,{"$f":"Data!Q23","v":"03.03.2017"}]
[null,null,null,null,null,null,null,null,null,null,null,null,null,{"$f":"'Protokoll 1 (5nm)'!N6:BG6","v":"36W/840"},null,null,null,null,null,null,null,null,null,null,null,null,null,null,null,null,null,null,null,null,null,null,null,null,null,null,null,null,null,null,null,null,null,null,null,null,null,null,null,null,null,null,null,null,null,null,null,null,{"$f":"IF(Data!$AE$2=\"DE\",\"Uhrzeit der Messung:\",IF(Data!$AE$2=\"UK\",\"Time of measurement:\",IF(Data!$AE$2=\"FR\",\"Heure de mesure:\",\"Language Error\")))","v":"Uhrzeit der Messung:"},null,null,null,null,null,null,null,null,null,null,null,null,null,null,null,null,null,null,null,null,null,{"$f":"Data!Q21","v":"08:17:53"}]
[null,null,null,null,null,null,null,null,null,null,null,null,null,null,null,null,null,null,null,null,null,null,null,null,null,null,null,null,null,null,null,null,null,null,null,null,null,null,null,null,null,null,null,null,null,null,null,null,null,null,null,null,null,null,null,null,null,null,null,null,null,null,{"$f":"IF(Data!$AE$2=\"DE\",\"Referenzdatei:\",IF(Data!$AE$2=\"UK\",\"Reference file:\",IF(Data!$AE$2=\"FR\",\"Fichier de référence:\",\"Language Error\")))","v":"Referenzdatei:"},null,null,null,null,null,null,null,null,null,null,null,null,null,null,null,null,null,null,null,null,null,{"$f":"Data!AC18","v":"Test-R.CSV"}]
[null,null,null,null,null,null,null,null,null,null,null,null,null,null,null,null,null,null,null,null,null,null,null,null,null,null,null,null,null,null,null,null,null,null,null,null,null,null,null,null,null,null,null,null,null,null,null,null,null,null,null,null,null,null,null,null,null,null,null,null,null,null,{"$f":"IF(Data!$AE$2=\"DE\",\"Datum der Messung:\",IF(Data!$AE$2=\"UK\",\"Date of measurement:\",IF(Data!$AE$2=\"FR\",\"Date de mesure:\",\"Language Error\")))","v":"Datum der Messung:"},null,null,null,null,null,null,null,null,null,null,null,null,null,null,null,null,null,null,null,null,null,{"$f":"Data!AC23","v":"03.03.2017"}]
[null,null,null,null,null,null,null,null,null,null,null,null,null,null,null,null,null,null,null,null,null,null,null,null,null,null,null,null,null,null,null,null,null,null,null,null,null,null,null,null,null,null,null,null,null,null,null,null,null,null,null,null,null,null,null,null,null,null,null,null,null,null,{"$f":"IF(Data!$AE$2=\"DE\",\"Uhrzeit der Messung:\",IF(Data!$AE$2=\"UK\",\"Time of measurement:\",IF(Data!$AE$2=\"FR\",\"Heure de mesure:\",\"Language Error\")))","v":"Uhrzeit der Messung:"},null,null,null,null,null,null,null,null,null,null,null,null,null,null,null,null,null,null,null,null,null,{"$f":"Data!AC21","v":"08:16:07"}]
[]
[]
[]
[]
[]
[]
[]
[]
[]
[]
[]
[]
[]
[]
[]
[null,null,null,null,null,null,{"$f":"Data!$AB$18","v":"Referenz"},null,null,null,null,null,null,null,null,null,{"$f":"Data!$P$18","v":"Messwert"},null,null,null,null,null,null,null,null,null,null,null,null,"Δ",null,null,null,null,null,null,null,null,null,null,null,null,null,null,null,null,null,null,null,null,null,null,null,null,null,null,null,null,null,null,null,null,null,null,null,null,{"$f":"Data!$AB$18","v":"Referenz"},null,null,null,null,null,null,null,null,null,null,null,{"$f":"Data!$P$18","v":"Messwert"},null,null,null,null,null,null,null,null,null,null,null,null,"Δ"]
[null,"Ra",null,null,null,null,{"$f":"Data!W1","v":96.95},null,null,null,null,null,null,null,null,null,{"$f":"Data!K1","v":79.81},null,null,null,null,null,null,null,null,null,null,null,null,{"$f":"Q26-G26","v":-17.14},null,null,null,null,null,null,{"$f":"IF(Data!$AE$2=\"DE\",\"Beleuchtungsstärke\",IF(Data!$AE$2=\"UK\",\"Illuminance\",IF(Data!$AE$2=\"FR\",\"Illuminance\",\"Language Error\")))","v":"Beleuchtungsstärke"},null,null,null,null,null,null,null,null,null,null,null,null,null,null,null,null,null,null,null,null,null,null,null,null,null,null,null,null,null,{"$f":"Data!W33","v":10027.19},null,null,null,null,null,null,null,null,null,null,null,{"$f":"Data!K33","v":3356.21},null,null,null,null,null,null,null,null,null,null,null,null,{"$f":"CA26-BO26","v":-6670.9800000000005}]
[null,"R1",null,null,null,null,{"$f":"Data!W2","v":96.04},null,null,null,null,null,null,null,null,null,{"$f":"Data!K2","v":91.71},null,null,null,null,null,null,null,null,null,null,null,null,{"$f":"Q27-G27","v":-4.3300000000000125},null,null,null,null,null,null,"Ee",null,null,null,null,null,null,null,null,null,null,null,null,null,null,null,null,null,null,null,null,null,null,null,null,null,null,null,null,null,{"$f":"Data!AC25","v":50.146999999999998},null,null,null,null,null,null,null,null,null,null,null,{"$f":"Data!Q25","v":9.4},null,null,null,null,null,null,null,null,null,null,null,null,{"$f":"CA27-BO27","v":-40.747}]
[null,"R2",null,null,null,null,{"$f":"Data!W3","v":97.21},null,null,null,null,null,null,null,null,null,{"$f":"Data!K3","v":88.83},null,null,null,null,null,null,null,null,null,null,null,null,-8.3799999999999955,null,null,null,null,null,null,"LER",null,null,null,null,null,null,null,null,null,null,null,null,null,null,null,null,null,null,null,null,null,null,null,null,null,null,null,null,null,{"$f":"Data!AC26","v":200},null,null,null,null,null,null,null,null,null,null,null,{"$f":"Data!Q26","v":357},null,null,null,null,null,null,null,null,null,null,null,null,{"$f":"CA28-BO28","v":157}]
[null,"R3",null,null,null,null,{"$f":"Data!W4","v":98.85},null,null,null,null,null,null,null,null,null,{"$f":"Data!K4","v":57.53},null,null,null,null,null,null,null,null,null,null,null,null,-41.319999999999993]
[null,"R4",null,null,null,null,{"$f":"Data!W5","v":96.56},null,null,null,null,null,null,null,null,null,{"$f":"Data!K5","v":86.75},null,null,null,null,null,null,null,null,null,null,null,null,-9.8100000000000023,null,null,null,null,null,null,{"$f":"IF(Data!$AE$2 = \"DE\", \"Ähnlichste Farbtemperatur (CCT)\", IF(Data!$AE$2 = \"UK\",\"correlated color temperature (CCT)\",IF(Data!$AE$2=\"FR\",\"temp. de couleur proximale (CCT)\",\"Language Error\")))","v":"Ähnlichste Farbtemperatur (CCT)"},null,null,null,null,null,null,null,null,null,null,null,null,null,null,null,null,null,null,null,null,null,null,null,null,null,null,null,null,null,{"$f":"Data!W30","v":5445},null,null,null,null,null,null,null,null,null,null,null,{"$f":"Data!K30","v":3809},null,null,null,null,null,null,null,null,null,null,null,null,{"$f":"CA30-BO30","v":-1636}]
[null,"R5",null,null,null,null,{"$f":"Data!W6","v":96.15},null,null,null,null,null,null,null,null,null,{"$f":"Data!K6","v":81.88},null,null,null,null,null,null,null,null,null,null,null,null,-14.27000000000001,null,null,null,null,null,null,"Duv",null,null,null,null,null,null,null,null,null,null,null,null,null,null,null,null,null,null,null,null,null,null,null,null,null,null,null,null,null,{"$f":"Data!W31","v":8.0000000000000004E-4},null,null,null,null,null,null,null,null,null,null,null,{"$f":"Data!K31","v":5.7000000000000002E-3},null,null,null,null,null,null,null,null,null,null,null,null,{"$f":"CA31-BO31","v":4.8999999999999998E-3}]
[null,"R6",null,null,null,null,{"$f":"Data!W7","v":96.64},null,null,null,null,null,null,null,null,null,{"$f":"Data!K7","v":75.45},null,null,null,null,null,null,null,null,null,null,null,null,-21.189999999999998]
[null,"R7",null,null,null,null,{"$f":"Data!W8","v":98.87},null,null,null,null,null,null,null,null,null,{"$f":"Data!K8","v":88.44},null,null,null,null,null,null,null,null,null,null,null,null,-10.430000000000007,null,null,null,null,null,null,{"$f":"IF(Data!$AE$2 = \"DE\", \"Farbreinheit\",IF(Data!$AE$2 = \"UK\",\"Saturation\",IF(Data!$AE$2=\"FR\",\"Saturation\",\"Language Error\")))","v":"Farbreinheit"},null,null,null,null,null,null,null,null,null,null,null,null,null,null,null,null,null,null,null,null,null,null,null,null,null,null,null,null,null,{"$f":"Data!W39/100","v":3.2000000000000001E-2},null,null,null,null,null,null,null,null,null,null,null,{"$f":"Data!K39/100","v":0.375},null,null,null,null,null,null,null,null,null,null,null,null,{"$f":"CA33-BO33","v":0.34299999999999997}]
[null,"R8",null,null,null,null,{"$f":"Data!W9","v":95.27},null,null,null,null,null,null,null,null,null,{"$f":"Data!K9","v":67.86},null,null,null,null,null,null,null,null,null,null,null,null,-27.409999999999997]
[null,"R9",null,null,null,null,{"$f":"Data!W10","v":85.8},null,null,null,null,null,null,null,null,null,{"$f":"Data!K10","v":-4.37},null,null,null,null,null,null,null,null,null,null,null,null,-90.17,null,null,null,null,null,null,{"$f":"IF(Data!$AE$2 = \"DE\", \"Dominante Wellenlänge\", IF(Data!$AE$2 = \"UK\", \"Dominant wavelength\",IF(Data!$AE$2=\"FR\",\"Longueur d'onde dominante (λD)\",\"Language Error\")))","v":"Dominante Wellenlänge"},null,null,null,null,null,null,null,null,null,null,null,null,null,null,null,null,null,null,null,null,null,null,null,null,null,null,null,null,null,{"$f":"Data!W40","v":{"$error":"#N/A"}},null,null,null,null,null,null,null,null,null,null,null,{"$f":"Data!K40","v":577},null,null,null,null,null,null,null,null,null,null,null,null,{"$f":"CA35-BO35","v":{"$error":"#N/A"}}]
[null,"R10",null,null,null,null,{"$f":"Data!W11","v":93.74},null,null,null,null,null,null,null,null,null,{"$f":"Data!K11","v":44.54},null,null,null,null,null,null,null,null,null,null,null,null,-49.199999999999996,null,null,null,null,null,null,{"$f":"IF(Data!$AE$2 = \"DE\", \"Peak-Wellenlänge\",IF(Data!$AE$2 = \"UK\", \"Peak wavelength\",IF(Data!$AE$2=\"FR\",\"Pic courbe spectrale (λP)\",\"Language Error\")))","v":"Peak-Wellenlänge"},null,null,null,null,null,null,null,null,null,null,null,null,null,null,null,null,null,null,null,null,null,null,null,null,null,null,null,null,null,{"$f":"Data!W20","v":477},null,null,null,null,null,null,null,null,null,null,null,{"$f":"Data!K20","v":543},null,null,null,null,null,null,null,null,null,null,null,null,{"$f":"CA36-BO36","v":66}]
[null,"R11",null,null,null,null,{"$f":"Data!W12","v":95.73},null,null,null,null,null,null,null,null,null,{"$f":"Data!K12","v":71.98},null,null,null,null,null,null,null,null,null,null,null,null,-23.75]
[null,"R12",null,null,null,null,{"$f":"Data!W13","v":94.14},null,null,null,null,null,null,null,null,null,{"$f":"Data!K13","v":49.3},null,null,null,null,null,null,null,null,null,null,null,null,-44.84,null,null,null,null,null,null,"TM30 Rf",null,null,null,null,null,null,null,null,null,null,null,null,null,null,null,null,null,null,null,null,null,null,null,null,null,null,null,null,null,{"$f":"Data!W43","v":96.1},null,null,null,null,null,null,null,null,null,null,null,{"$f":"Data!K43","v":77.599999999999994},null,null,null,null,null,null,null,null,null,null,null,null,{"$f":"CA38-BO38","v":-18.5}]
[null,"R13",null,null,null,null,{"$f":"Data!W14","v":96.08},null,null,null,null,null,null,null,null,null,{"$f":"Data!K14","v":92.95},null,null,null,null,null,null,null,null,null,null,null,null,-3.1299999999999955,null,null,null,null,null,null,"TM30 Rg",null,null,null,null,null,null,null,null,null,null,null,null,null,null,null,null,null,null,null,null,null,null,null,null,null,null,null,null,null,{"$f":"Data!W44","v":99.8},null,null,null,null,null,null,null,null,null,null,null,{"$f":"Data!K44","v":97.5},null,null,null,null,null,null,null,null,null,null,null,null,{"$f":"CA39-BO39","v":-2.2999999999999972}]
[null,"R14",null,null,null,null,{"$f":"Data!W15","v":99.31},null,null,null,null,null,null,null,null,null,{"$f":"Data!K15","v":71.88},null,null,null,null,null,null,null,null,null,null,null,null,-27.430000000000007]
[null,"R15",null,null,null,null,{"$f":"Data!W16","v":95.11},null,null,null,null,null,null,null,null,null,{"$f":"Data!K16","v":88.02},null,null,null,null,null,null,null,null,null,null,null,null,-7.0900000000000034]
[]
[null,"Re",null,null,null,null,{"$f":"Data!AC27","v":95.7},null,null,null,null,null,null,null,null,null,{"$f":"Data!Q27","v":70.180000000000007},null,null,null,null,null,null,null,null,null,null,null,null,{"$f":"Q43-G43","v":-25.519999999999996}]
[null,"GAI",null,null,null,null,{"$f":"Data!AC28","v":95.1},null,null,null,null,null,null,null,null,null,{"$f":"Data!Q28","v":69.14},null,null,null,null,null,null,null,null,null,null,null,null,{"$f":"Q44-G44","v":-25.959999999999994}]
[]
[]
[]
[]
[]
[]
[{"$f":"'Protokoll 1 (5nm)'!A54:AA54","v":"Firma"}]
[{"$f":"'Protokoll 1 (5nm)'!A55:AA55","v":"Adresse"}]
[{"$f":"'Protokoll 1 (5nm)'!A56:AA56","v":"PLZ  Ort"}]
[]
[{"$f":"'Protokoll 1 (5nm)'!A58:O58","v":"Prüfort,"},null,null,null,null,null,null,null,null,null,null,null,null,null,null,{"$f":"'Protokoll 1 (5nm)'!P58:AA58","v":"Datum"},null,null,null,null,null,null,null,null,null,null,null,null,null,null,null,null,null,null,null,null,null,null,null,null,null,null,null,null,null,null,null,null,null,null,null,null,null,null,null,null,null,null,null,null,null,null,null,{"$f":"'Protokoll 1 (5nm)'!BL58:CF58","v":"Vorname, Nachname Prüfer"},null,null,null,null,null,null,null,null,null,null,null,null,null,null,null,null,null,null,null,null,{"$f":"'Protokoll 1 (5nm)'!CG58:CX58","v":"Telefonnummer"}]

{"sheet":"Data","index":5,"n_rows":258,"n_cols":38,"rows_kept":258,"cut":false,"hidden":false,"merged":[]}
["Seriennummer","16C12345","Seriennummer","16C12345",null,1,{"$f":"IF(INDEX($A$1:$A$500,MATCH(\"Spe*\",$A$1:$A$500,0)+F1)=0,\"\",INDEX($A$1:$A$500,MATCH(\"Spe*\",$A$1:$A$500,0)+F1))","v":380},{"$f":"IF(INDEX($A$1:$A$500,MATCH(\"Spe*\",$A$1:$A$500,0)+F1)=0,\"\",INDEX($B$1:$B$500,MATCH(\"Spe*\",$A$1:$A$500,0)+F1))","v":0.57240000000000002},"CRI","Ra",{"$f":"IF(ISNA(MATCH(I1,$A$1:$A$200,0)),IF($A$1=\"\",NA(),INDEX($B$1:$B$200,MATCH(J1,$A$1:$A$200,0))),IF($A$1=\"\",NA(),INDEX($B$1:$B$200,MATCH(I1,$A$1:$A$200,0))))","v":79.81},{"$f":"IF(K1=\"\",NA(),IF(K1 < 0, 0, K1))","v":79.81},{"$f":"IF(G1=\"\",NA(),ROUND(G1,0))","v":380},{"$f":"IF(H1=\"\",NA(),H1)","v":0.57240000000000002},null,"R15",{"$f":"IF($A$1=\"\",NA(),INDEX($B$1:$B$200,MATCH(P1,$A$1:$A$200,0)))","v":88.02},1,{"$f":"IF(INDEX($C$1:$C$500,MATCH(\"Spe*\",$C$1:$C$500,0)+R1)=0,\"\",INDEX($C$1:$C$500,MATCH(\"Spe*\",$C$1:$C$500,0)+R1))","v":380},{"$f":"IF(INDEX($C$1:$C$500,MATCH(\"Spe*\",$C$1:$C$500,0)+R1)=0,\"\",INDEX($D$1:$D$500,MATCH(\"Spe*\",$C$1:$C$500,0)+R1))","v":42.606900000000003},"CRI","Ra",{"$f":"IF(ISNA(MATCH(U1,$C$1:$C$200,0)),IF($C$1=\"\",NA(),INDEX($D$1:$D$200,MATCH(V1,$C$1:$C$200,0))),IF($C$1=\"\",NA(),INDEX($D$1:$D$200,MATCH(U1,$C$1:$C$200,0))))","v":96.95},null,{"$f":"IF(S1=\"\",NA(),ROUND(S1,0))","v":380},{"$f":"IF(T1=\"\",NA(),T1)","v":42.606900000000003},null,"R15",{"$f":"IF($C$1=\"\",NA(),INDEX($D$1:$D$200,MATCH(AB1,$C$1:$C$200,0)))","v":95.11},null,null,null,"u","v","u'","v'","x","y"]
["Software Rev.","1.1.3","Software Rev.","1.1.0 f",null,{"$f":"F1+1","v":2},{"$f":"IF(INDEX($A$1:$A$500,MATCH(\"Spe*\",$A$1:$A$500,0)+F2)=0,\"\",INDEX($A$1:$A$500,MATCH(\"Spe*\",$A$1:$A$500,0)+F2))","v":385},{"$f":"IF(INDEX($A$1:$A$500,MATCH(\"Spe*\",$A$1:$A$500,0)+F2)=0,\"\",INDEX($B$1:$B$500,MATCH(\"Spe*\",$A$1:$A$500,0)+F2))","v":0.20680000000000001},null,"R1",{"$f":"IF($A$1=\"\",NA(),INDEX($B$1:$B$200,MATCH(J2,$A$1:$A$200,0)))","v":91.71},{"$f":"IF(K2=\"\",NA(),IF(K2 < 0, 0, K2))","v":91.71},385,{"$f":"IF(H2=\"\",NA(),H2)","v":0.20680000000000001},null,"R14",{"$f":"IF($A$1=\"\",NA(),INDEX($B$1:$B$200,MATCH(P2,$A$1:$A$200,0)))","v":71.88},{"$f":"R1+1","v":2},{"$f":"IF(INDEX($C$1:$C$500,MATCH(\"Spe*\",$C$1:$C$500,0)+R2)=0,\"\",INDEX($C$1:$C$500,MATCH(\"Spe*\",$C$1:$C$500,0)+R2))","v":385},{"$f":"IF(INDEX($C$1:$C$500,MATCH(\"Spe*\",$C$1:$C$500,0)+R2)=0,\"\",INDEX($D$1:$D$500,MATCH(\"Spe*\",$C$1:$C$500,0)+R2))","v":44.198099999999997},null,"R1",{"$f":"IF($C$1=\"\",NA(),INDEX($D$1:$D$200,MATCH(V2,$C$1:$C$200,0)))","v":96.04},null,385,{"$f":"IF(T2=\"\",NA(),T2)","v":44.198099999999997},null,"R14",{"$f":"IF($C$1=\"\",NA(),INDEX($D$1:$D$200,MATCH(AB2,$C$1:$C$200,0)))","v":99.31},null,"DE",null,0.18006,0.26351999999999998,{"$f":"AG2","v":0.18006},{"$f":"AH2*1.5","v":0.39527999999999996},{"$f":"(9*AG2)/(6*AG2-16*AJ2+12)","v":0.23987104566688575},{"$f":"(4*AJ2)/(6*AG2-16*AJ2+12)","v":0.23403612852803776}]
["Zeit","08:17:53","Zeit","08:16:07",null,{"$f":"F2+1","v":3},390,0.46150000000000002,null,"R2",88.83,88.83,390,0.46150000000000002,null,"R13",92.95,{"$f":"R2+1","v":3},390,48.4497,null,"R2",97.21,null,390,48.4497,null,"R13",96.08,null,null,null,0.18065999999999999,0.26589000000000002,{"$f":"AG3","v":0.18065999999999999},{"$f":"AH3*1.5","v":0.39883500000000005},{"$f":"(9*AG3)/(6*AG3-16*AJ3+12)","v":0.24258347506937611},{"$f":"(4*AJ3)/(6*AG3-16*AJ3+12)","v":0.23801808253513571}]
["Datum","03.03.2017","Datum","03.03.2017",null,4,395,1.4525999999999999,null,"R3",57.53,57.53,395,1.4525999999999999,null,"R12",49.3,4,395,59.812899999999999,null,"R3",98.85,null,395,59.812899999999999,null,"R12",94.14,null,null,null,0.18132999999999999,0.26845999999999998,0.18132999999999999,0.40268999999999999,0.24559589702841558,0.24240399461846157]
[null,null,null,null,null,5,400,15.3386,null,"R4",86.75,86.75,400,15.3386,null,"R11",71.98,5,400,79.426900000000003,null,"R4",96.56,null,400,79.426900000000003,null,"R11",95.73,null,null,null,0.18207999999999999,0.27118999999999999,0.18207999999999999,0.40678499999999995,0.24889731345459842,0.24713848284912326]
["Integrationszeit [ms]",164,"Integrationszeit [ms]",178,null,6,405,19.5168,null,"R5",81.88,81.88,405,19.5168,null,"R10",44.54,6,405,88.917500000000004,null,"R5",96.15,null,405,88.917500000000004,null,"R10",93.74,null,null,null,0.18293000000000001,0.27406999999999998,0.18293000000000001,0.41110499999999994,0.25251460911977175,0.25221552477798731]
["E vis [lx]",3356.21,"E vis [lx]",10027.19,null,7,410,7.0986000000000002,null,"R6",75.45,75.45,410,7.0986000000000002,null,"R9",-4.37,7,410,94.227699999999999,null,"R6",96.64,null,410,94.227699999999999,null,"R9",85.8,null,null,null,0.18387999999999999,0.27709,0.18387999999999999,0.41563499999999998,0.25645269265099674,0.25763351681047303]
["Ee [W/m²]",9.4,"Ee [W/m≤]",50.146999999999998,null,8,415,5.8689,null,"R7",88.44,88.44,415,5.8689,null,"R8",67.86,8,415,98.613500000000002,null,"R7",98.87,null,415,98.613500000000002,null,"R8",95.27,null,null,null,0.18493999999999999,0.28021000000000001,0.18493999999999999,0.42031499999999999,0.26069918240766848,0.26333051404943147]
["LER [lm/W]",357,"LER [lm/W]",200,null,9,420,8.2623999999999995,null,"R8",67.86,67.86,420,8.2623999999999995,null,"R7",88.44,9,420,100.07470000000001,null,"R8",95.27,null,420,100.07470000000001,null,"R7",98.87,null,null,null,0.18611,0.28342000000000001,0.18611,0.42513000000000001,0.26525754682021607,0.2693005710593579]
["CCT [K]",3809,"CCT [K]",5445,null,10,425,11.879099999999999,null,"R9",-4.37,0,425,11.879099999999999,null,"R6",75.45,10,425,98.543899999999994,null,"R9",85.8,null,425,98.543899999999994,null,"R6",96.64,null,null,null,0.18740000000000001,0.28667999999999999,0.18740000000000001,0.43001999999999996,0.27011184994426723,0.27547372871583958]
["Duv",5.7000000000000002E-3,"Duv",8.0000000000000004E-4,null,11,430,41.239100000000001,null,"R10",44.54,44.54,430,41.239100000000001,null,"R5",81.88,11,430,100.3488,null,"R10",93.74,null,430,100.3488,null,"R5",96.15,null,null,null,0.1888,0.28997000000000001,0.1888,0.43495499999999998,0.27524005753605724,0.28181977218831394]
["TM30 Rf",77.599999999999994,"TM30 Rf",96.1,null,12,435,64.129900000000006,null,"R11",71.98,71.98,435,64.129900000000006,null,"R4",86.75,12,435,110.0917,null,"R11",95.73,null,435,110.0917,null,"R4",96.56,null,null,null,0.19031999999999999,0.29326000000000002,0.19031999999999999,0.43989,0.28063070147845237,0.28827854671280279]
["TM30 Rg",97.5,"TM30 Rg",99.8,null,13,440,32.883200000000002,null,"R12",49.3,49.3,440,32.883200000000002,null,"R3",57.53,13,440,119.6392,null,"R12",94.14,null,440,119.6392,null,"R3",98.85,null,null,null,0.19461999999999999,0.30141000000000001,0.19461999999999999,0.45211500000000004,0.29518291573135957,0.3047685494145484]
["R-Bin01 a",0.972329,"R-Bin01 a",0.97702599999999995,null,14,445,18.284300000000002,null,"R13",92.95,92.95,445,18.284300000000002,null,"R2",88.83,14,445,128.72730000000001,null,"R13",96.08,null,445,128.72730000000001,null,"R2",97.21,null,null,null,0.19961999999999999,0.30920999999999998,0.19961999999999999,0.46381499999999998,0.3110056295311493,0.32116371341324079]
["R-Bin01 b",0.23361499999999999,"R-Bin01 b",0.21312,null,15,450,18.1922,null,"R14",71.88,71.88,450,18.1922,null,"R1",91.71,15,450,135.43520000000001,null,"R14",99.31,null,450,135.43520000000001,null,"R1",96.04,null,null,null,0.20524999999999999,0.31646999999999997,0.20524999999999999,0.47470499999999993,0.32774625546909086,0.33689600476915366]
["R-Bin02 a",0.81872999999999996,"R-Bin02 a",0.83705300000000005,null,16,455,17.9373,null,"R15",88.02,88.02,455,17.9373,"CRI","Ra",{"$f":"IF(ISNA(MATCH(O16,$A$1:$A$200,0)),IF($A$1=\"\",NA(),INDEX($B$1:$B$200,MATCH(P16,$A$1:$A$200,0))),IF($A$1=\"\",NA(),INDEX($B$1:$B$200,MATCH(O16,$A$1:$A$200,0))))","v":79.81},16,455,138.93799999999999,null,"R15",95.11,null,455,138.93799999999999,"CRI","Ra",{"$f":"IF(ISNA(MATCH(AA16,$C$1:$C$200,0)),IF($C$1=\"\",NA(),INDEX($D$1:$D$200,MATCH(AB16,$C$1:$C$200,0))),IF($C$1=\"\",NA(),INDEX($D$1:$D$200,MATCH(AA16,$C$1:$C$200,0))))","v":96.95},null,null,null,0.21142,0.32312000000000002,0.21142,0.48468,0.34510414172851323,0.35162252160097501]
["R-Bin02 b",0.57417799999999997,"R-Bin02 b",0.547122,null,17,460,16.9191,null,"Integrationtime [ms]",null,null,460,16.9191,null,null,null,17,460,142.422,null,"Integrationtime [ms]",null,null,460,142.422,null,null,null,null,null,null,0.21807000000000001,0.32908999999999999,0.21807000000000001,0.49363499999999999,0.36276075456632401,0.36496212751328033]
["R-Bin03 a",0.55100700000000002,"R-Bin03 a",0.54184900000000003,null,18,465,15.5221,null,"Integrationszeit [ms]",{"$f":"IF(ISNA(MATCH(J17,$A$1:$A$200,0)),IF($A$1=\"\",NA(),INDEX($B$1:$B$200,MATCH(J18,$A$1:$A$200,0))),IF($A$1=\"\",NA(),INDEX($B$1:$B$200,MATCH(J17,$A$1:$A$200,0))))","v":164},null,465,15.5221,null,"Messwert","Test-M.CSV",18,465,142.47620000000001,null,"Integrationszeit [ms]",{"$f":"IF(ISNA(MATCH(V17,$C$1:$C$200,0)),IF($C$1=\"\",NA(),INDEX($D$1:$D$200,MATCH(V18,$C$1:$C$200,0))),IF($C$1=\"\",NA(),INDEX($D$1:$D$200,MATCH(V17,$C$1:$C$200,0))))","v":178},null,465,142.47620000000001,null,"Referenz","Test-R.CSV",null,null,null,0.22511,0.33439000000000002,0.22511,0.50158500000000006,0.38044617204664538,0.37675623908512212]
["R-Bin03 b",0.83450100000000005,"R-Bin03 b",0.840476,null,19,470,14.143000000000001,null,null,null,null,470,14.143000000000001,null,null,null,19,470,142.67830000000001,null,null,null,null,470,142.67830000000001,null,null,null,null,null,null,0.23247000000000001,0.33904000000000001,0.23247000000000001,0.50856000000000001,0.39792425055060426,0.38689504855587636]
["R-Bin04 a",0.167075,"R-Bin04 a",0.17887400000000001,null,20,475,14.642799999999999,null,"Lambda Peak [nm]",{"$f":"IF($A$1=\"\",NA(),INDEX($B$1:$B$200,MATCH(J20,$A$1:$A$200,0)))","v":543},null,475,14.642799999999999,null,"Time",null,20,475,144.50649999999999,null,"Lambda Peak [nm]",477,null,475,144.50649999999999,null,"Time",null,null,null,null,0.24010000000000001,0.34308,0.24010000000000001,0.51461999999999997,0.41502454539168915,0.39535366106616876]
["R-Bin04 b",0.98594400000000004,"R-Bin04 b",0.98387199999999997,null,21,480,24.472799999999999,null,"Lambda Peak",{"$f":"IF($A$1=\"\",NA(),INDEX($B$1:$B$200,MATCH(J21,$A$1:$A$200,0)))","v":168576.39},null,480,24.472799999999999,null,"Zeit",{"$f":"IF(ISNA(MATCH(P20,$A$1:$A$200,0)),IF($A$1=\"\",NA(),INDEX($B$1:$B$200,MATCH(P21,$A$1:$A$200,0))),IF($A$1=\"\",NA(),INDEX($B$1:$B$200,MATCH(P20,$A$1:$A$200,0))))","v":"08:17:53"},21,480,143.83430000000001,null,"Lambda Peak",144880.75,null,480,143.83430000000001,null,"Zeit",{"$f":"IF(ISNA(MATCH(AB20,$C$1:$C$200,0)),IF($C$1=\"\",NA(),INDEX($D$1:$D$200,MATCH(AB21,$C$1:$C$200,0))),IF($C$1=\"\",NA(),INDEX($D$1:$D$200,MATCH(AB20,$C$1:$C$200,0))))","v":"08:16:07"},null,null,null,0.24701999999999999,0.34655000000000002,0.24701999999999999,0.51982499999999998,0.43043841918171039,0.40258125972909548]
["R-Bin05 a",-0.114747,"R-Bin05 a",-8.3003999999999994E-2,null,22,485,39.417099999999998,null,null,null,null,485,39.417099999999998,null,"Date",null,22,485,140.54050000000001,null,null,null,null,485,140.54050000000001,null,"Date",null,null,null,null,0.25591000000000003,0.34950999999999999,0.25591000000000003,0.52426499999999998,0.44746290230454494,0.40741604205765436]
["R-Bin05 b",0.99339500000000003,"R-Bin05 b",0.99654900000000002,null,23,490,36.798900000000003,null,"x",{"$f":"IF($A$1=\"\",NA(),INDEX($B$1:$B$200,MATCH(J23,$A$1:$A$200,0)))","v":0.39400000000000002},null,490,36.798900000000003,null,"Datum",{"$f":"IF(ISNA(MATCH(P22,$A$1:$A$200,0)),IF($A$1=\"\",NA(),INDEX($B$1:$B$200,MATCH(P23,$A$1:$A$200,0))),IF($A$1=\"\",NA(),INDEX($B$1:$B$200,MATCH(P22,$A$1:$A$200,0))))","v":"03.03.2017"},23,490,142.1223,null,"x",0.3337,null,490,142.1223,null,"Datum",{"$f":"IF(ISNA(MATCH(AB22,$C$1:$C$200,0)),IF($C$1=\"\",NA(),INDEX($D$1:$D$200,MATCH(AB23,$C$1:$C$200,0))),IF($C$1=\"\",NA(),INDEX($D$1:$D$200,MATCH(AB22,$C$1:$C$200,0))))","v":"03.03.2017"},null,null,null,0.26400000000000001,0.35199999999999998,0.26400000000000001,0.52800000000000002,0.46261682242990665,0.41121495327102814]
["R-Bin06 a",-0.55188400000000004,"R-Bin06 a",-0.50571299999999997,null,24,495,23.702999999999999,null,"y",0.39760000000000001,null,495,23.702999999999999,null,"Ee [W/m≤]",null,24,495,143.5925,null,"y",0.34370000000000001,null,495,143.5925,null,"Ee [W/m≤]",null,null,null,null,0.27217999999999998,0.35407,0.27217999999999998,0.53110499999999994,0.47700665965650185,0.4136815048486972]
["R-Bin06 b",0.83392100000000002,"R-Bin06 b",0.86270199999999997,null,25,500,13.5647,null,"u'",0.22570000000000001,null,500,13.5647,null,"Ee [W/m²]",{"$f":"IF(ISNA(MATCH(P24,$A$1:$A$200,0)),IF($A$1=\"\",NA(),INDEX($B$1:$B$200,MATCH(P25,$A$1:$A$200,0))),IF($A$1=\"\",NA(),INDEX($B$1:$B$200,MATCH(P24,$A$1:$A$200,0))))","v":9.4},25,500,142.37469999999999,null,"u'",0.20669999999999999,null,500,142.37469999999999,null,"Ee [W/m²]",{"$f":"IF(ISNA(MATCH(AB24,$C$1:$C$200,0)),IF($C$1=\"\",NA(),INDEX($D$1:$D$200,MATCH(AB25,$C$1:$C$200,0))),IF($C$1=\"\",NA(),INDEX($D$1:$D$200,MATCH(AB24,$C$1:$C$200,0))))","v":50.146999999999998},null,null,null,0.28038999999999997,0.35576999999999998,0.28038999999999997,0.53365499999999999,0.49058683556706439,0.41498407810476956]
["R-Bin07 a",-0.85936999999999997,"R-Bin07 a",-0.82126600000000005,null,26,505,8.2264999999999997,null,"v'",0.51239999999999997,null,505,8.2264999999999997,null,"LER [lm/W]",{"$f":"IF($A$1=\"\",NA(),INDEX($B$1:$B$200,MATCH(P26,$A$1:$A$200,0)))","v":357},26,505,143.08670000000001,null,"v'",0.47899999999999998,null,505,143.08670000000001,null,"LER [lm/W]",{"$f":"IF($C$1=\"\",NA(),INDEX($D$1:$D$200,MATCH(AB26,$C$1:$C$200,0)))","v":200},null,null,null,0.28863,0.35714000000000001,0.28863,0.53571000000000002,0.503383445533503,0.41524527073377748]
["R-Bin07 b",0.51135399999999998,"R-Bin07 b",0.570546,null,27,510,6.1430999999999996,null,"u",0.22570000000000001,null,510,6.1430999999999996,null,"Re",{"$f":"IF($A$1=\"\",NA(),INDEX($B$1:$B$200,MATCH(P27,$A$1:$A$200,0)))","v":70.180000000000007},27,510,142.2774,null,"u",0.20669999999999999,null,510,142.2774,null,"Re",{"$f":"IF($C$1=\"\",NA(),INDEX($D$1:$D$200,MATCH(AB27,$C$1:$C$200,0)))","v":95.7},null,null,null,0.29685,0.35822999999999999,0.29685,0.53734499999999996,0.51540634079149927,0.41465165001794119]
["R-Bin08 a",-0.99066100000000001,"R-Bin08 a",-0.99448300000000001,null,28,515,5.6165000000000003,null,"v",0.34160000000000001,null,515,5.6165000000000003,null,"GAI",{"$f":"IF(ISNA(MATCH(O28,$A$1:$A$200,0)),IF($A$1=\"\",NA(),INDEX($B$1:$B$200,MATCH(P28,$A$1:$A$200,0))),IF($A$1=\"\",NA(),INDEX($B$1:$B$200,MATCH(O28,$A$1:$A$200,0))))","v":69.14},28,515,138.19059999999999,null,"v",0.31940000000000002,null,515,138.19059999999999,null,"GAI",{"$f":"IF(ISNA(MATCH(AA28,$C$1:$C$200,0)),IF($C$1=\"\",NA(),INDEX($D$1:$D$200,MATCH(AB28,$C$1:$C$200,0))),IF($C$1=\"\",NA(),INDEX($D$1:$D$200,MATCH(AA28,$C$1:$C$200,0))))","v":95.1},null,null,null,0.30504999999999999,0.35907,0.30504999999999999,0.538605,0.52669291066680479,0.41330847059636044]
["R-Bin08 b",0.13634499999999999,"R-Bin08 b",0.104897,null,29,520,5.7843,null,null,null,null,520,5.7843,null,null,null,29,520,138.24170000000001,null,null,null,null,520,138.24170000000001,null,null,null,null,null,null,0.31319999999999998,0.35968,0.31319999999999998,0.53952,0.53723355594181688,0.41130729119019305]
["R-Bin09 a",-0.99168999999999996,"R-Bin09 a",-0.98467899999999997,null,30,525,7.9572000000000003,null,"CCT [K]",3809,null,525,7.9572000000000003,null,null,null,30,525,139.9675,null,"CCT [K]",5445,null,525,139.9675,null,null,null,null,null,null,0.32129000000000002,0.36010999999999999,0.32129000000000002,0.54016500000000001,0.54712493614122726,0.40882102514616564]
["R-Bin09 b",-0.12865299999999999,"R-Bin09 b",-0.174374,null,31,530,17.520900000000001,null,"Duv",5.7000000000000002E-3,null,530,17.520900000000001,null,null,null,31,530,140.9057,null,"Duv",8.0000000000000004E-4,null,530,140.9057,null,null,null,null,null,null,0.32930999999999999,0.36037999999999998,0.32930999999999999,0.54056999999999999,0.55639847261176623,0.4059293301343786]
["R-Bin10 a",-0.86387800000000003,"R-Bin10 a",-0.87302000000000002,null,32,535,56.848999999999997,null,"E vis [fc]",null,null,535,56.848999999999997,null,null,null,32,535,140.9872,null,"E vis [fc]",null,null,535,140.9872,null,null,null,null,null,null,0.33723999999999998,0.36051,0.33723999999999998,0.54076499999999994,0.56508042895442345,0.40271447721179615]
["R-Bin10 b",-0.50370099999999995,"R-Bin10 b",-0.48768499999999998,null,33,540,139.41669999999999,null,"E vis [lx]",{"$f":"IF(ISNA(MATCH(J32,$A$1:$A$200,0)),IF($A$1=\"\",NA(),INDEX($B$1:$B$200,MATCH(J33,$A$1:$A$200,0))),IF($A$1=\"\",NA(),INDEX($B$1:$B$200,MATCH(J32,$A$1:$A$200,0))))","v":3356.21},null,540,139.41669999999999,null,null,null,33,540,140.2766,null,"E vis [lx]",{"$f":"IF(ISNA(MATCH(V32,$C$1:$C$200,0)),IF($C$1=\"\",NA(),INDEX($D$1:$D$200,MATCH(V33,$C$1:$C$200,0))),IF($C$1=\"\",NA(),INDEX($D$1:$D$200,MATCH(V32,$C$1:$C$200,0))))","v":10027.19},null,540,140.2766,null,null,null,null,null,null,0.37,0.35980000000000001,{"$f":"AG33","v":0.37},{"$f":"AH33*1.5","v":0.53970000000000007},{"$f":"(9*AG33)/(6*AG33-16*AJ33+12)","v":0.59626128061882266},{"$f":"(4*AJ33)/(6*AG33-16*AJ33+12)","v":0.38654920498495932}]
["R-Bin11 a",-0.58118099999999995,"R-Bin11 a",-0.569017,null,34,545,160.0821,null,null,null,null,545,160.0821,null,null,null,34,545,140.2628,null,null,null,null,545,140.2628,null,null,null,null,null,null,0.4,0.35699999999999998,{"$f":"AG34","v":0.4},{"$f":"AH34*1.5","v":0.53549999999999998},{"$f":"(9*AG34)/(6*AG34-16*AJ34+12)","v":0.61728395061728392},{"$f":"(4*AJ34)/(6*AG34-16*AJ34+12)","v":0.36728395061728386}]
["R-Bin11 b",-0.813774,"R-Bin11 b",-0.822326,null,35,550,86.403199999999998,null,"Flicker Index",{"$f":"IF($A$1=\"\",NA(),INDEX($B$1:$B$200,MATCH(J35,$A$1:$A$200,0)))","v":7.2999999999999995E-2},null,550,86.403199999999998,null,null,null,35,550,139.6259,null,"Flicker Index",0,null,550,139.6259]
["R-Bin12 a",-0.32591199999999998,"R-Bin12 a",-0.146569,null,36,555,32.056899999999999,null,"Flicker [Hz]",{"$f":"IF($A$1=\"\",NA(),INDEX($B$1:$B$200,MATCH(J36,$A$1:$A$200,0)))","v":100},null,555,32.056899999999999,null,null,null,36,555,138.0119,null,"Flicker [Hz]",0,null,555,138.0119]
["R-Bin12 b",-0.94540000000000002,"R-Bin12 b",-0.98919999999999997,null,37,560,16.082100000000001,null,"Flicker [%]",{"$f":"IF($A$1=\"\",NA(),INDEX($B$1:$B$200,MATCH(J37,$A$1:$A$200,0)))","v":25.5},null,560,16.082100000000001,null,null,null,37,560,135.1609,null,"Flicker [%]",0,null,560,135.1609]
["R-Bin13 a",0.104308,"R-Bin13 a",0.16619700000000001,null,38,565,13.2568,null,"Excitation Purity [%]",null,null,565,13.2568,null,null,null,38,565,132.79490000000001,null,"Excitation Purity [%]",null,null,565,132.79490000000001]
["R-Bin13 b",-0.99454500000000001,"R-Bin13 b",-0.986093,null,39,570,15.9605,null,"Farbreinheit [%]",{"$f":"IF(ISNA(MATCH(J38,$A$1:$A$200,0)),IF($A$1=\"\",NA(),INDEX($B$1:$B$200,MATCH(J39,$A$1:$A$200,0))),IF($A$1=\"\",NA(),INDEX($B$1:$B$200,MATCH(J38,$A$1:$A$200,0))))","v":37.5},null,570,15.9605,null,null,null,39,570,130.65530000000001,null,"Farbreinheit [%]",{"$f":"IF(ISNA(MATCH(V38,$C$1:$C$200,0)),IF($C$1=\"\",NA(),INDEX($D$1:$D$200,MATCH(V39,$C$1:$C$200,0))),IF($C$1=\"\",NA(),INDEX($D$1:$D$200,MATCH(V38,$C$1:$C$200,0))))","v":3.2},null,570,130.65530000000001]
["R-Bin14 a",0.44026500000000002,"R-Bin14 a",0.59516999999999998,null,40,575,28.370899999999999,null,"Dominante Wellenlänge [nm]",{"$f":"IF(ISNA(MATCH(J41,$A$1:$A$200,0)),IF($A$1=\"\",NA(),INDEX($B$1:$B$200,MATCH(\"Dominante Wellenl*\",$A$1:$A$200,0))),IF($A$1=\"\",NA(),INDEX($B$1:$B$200,MATCH(J41,$A$1:$A$200,0))))","v":577},null,575,28.370899999999999,null,null,null,40,575,130.70580000000001,null,"Dominante Wellenlänge [nm]",{"$f":"IF(ISNA(MATCH(V41,$C$1:$C$200,0)),IF($C$1=\"\",NA(),INDEX($D$1:$D$200,MATCH(V40,$C$1:$C$200,0))),IF($C$1=\"\",NA(),INDEX($D$1:$D$200,MATCH(V41,$C$1:$C$200,0))))","v":{"$error":"#N/A"}},null,575,130.70580000000001]
["R-Bin14 b",-0.897868,"R-Bin14 b",-0.80359999999999998,null,41,580,42.883899999999997,null,"Dominant wavelength [nm]",null,null,580,42.883899999999997,null,null,null,41,580,132.81399999999999,null,"Dominant wavelength [nm]",null,null,580,132.81399999999999]
["R-Bin15 a",0.80269800000000002,"R-Bin15 a",0.83299999999999996,null,42,585,47.615900000000003,null,null,null,null,585,47.615900000000003,null,null,null,42,585,133.1275,null,null,null,null,585,133.1275]
["R-Bin15 b",-0.59638599999999997,"R-Bin15 b",-0.55327300000000001,null,43,590,43.179000000000002,null,"TM30 Rf",{"$f":"IF($A$1=\"\",NA(),INDEX($B$1:$B$200,MATCH(J43,$A$1:$A$200,0)))","v":77.599999999999994},null,590,43.179000000000002,null,null,null,43,590,131.76060000000001,null,"TM30 Rf",{"$f":"IF($C$1=\"\",NA(),INDEX($D$1:$D$200,MATCH(V43,$C$1:$C$200,0)))","v":96.1},null,590,131.76060000000001]
["R-Bin16 a",0.98690299999999997,"R-Bin16 a",0.98522600000000005,null,44,595,36.741199999999999,null,"TM30 Rg",97.5,null,595,36.741199999999999,null,null,null,44,595,131.8843,null,"TM30 Rg",99.8,null,595,131.8843]
["R-Bin16 b",-0.16131499999999999,"R-Bin16 b",-0.171262,null,45,600,37.325099999999999,null,"R-Bin01 a",0.972329,null,600,37.325099999999999,null,null,null,45,600,132.66069999999999,null,"R-Bin01 a",0.97702599999999995,null,600,132.66069999999999]
["T-Bin01 a",0.86951199999999995,"T-Bin01 a",0.99664399999999997,null,46,605,78.079499999999996,null,"R-Bin01 b",0.23361499999999999,null,605,78.079499999999996,null,null,null,46,605,133.4066,null,"R-Bin01 b",0.21312,null,605,133.4066]
["T-Bin01 b",0.17516399999999999,"T-Bin01 b",0.21485299999999999,null,47,610,135.84289999999999,null,"R-Bin02 a",0.81872999999999996,null,610,135.84289999999999,null,null,null,47,610,133.0814,null,"R-Bin02 a",0.83705300000000005,null,610,133.0814]
["T-Bin02 a",0.78391599999999995,"T-Bin02 a",0.85506199999999999,null,48,615,105.47709999999999,null,"R-Bin02 b",0.57417799999999997,null,615,105.47709999999999,null,null,null,48,615,132.9246,null,"R-Bin02 b",0.547122,null,615,132.9246]
["T-Bin02 b",0.567747,"T-Bin02 b",0.54585099999999998,null,49,620,55.517299999999999,null,"R-Bin03 a",0.55100700000000002,null,620,55.517299999999999,null,null,null,49,620,133.13050000000001,null,"R-Bin03 a",0.54184900000000003,null,620,133.13050000000001]
["T-Bin03 a",0.44506499999999999,"T-Bin03 a",0.56872,null,50,625,43.192900000000002,null,"R-Bin03 b",0.83450100000000005,null,625,43.192900000000002,null,null,null,50,625,131.8954,null,"R-Bin03 b",0.840476,null,625,131.8954]
["T-Bin03 b",0.85654399999999997,"T-Bin03 b",0.82856799999999997,null,51,630,33.598399999999998,null,"R-Bin04 a",0.167075,null,630,33.598399999999998,null,null,null,51,630,132.32689999999999,null,"R-Bin04 a",0.17887400000000001,null,630,132.32689999999999]
["T-Bin04 a",1.6931999999999999E-2,"T-Bin04 a",0.203288,null,52,635,18.711099999999998,null,"R-Bin04 b",0.98594400000000004,null,635,18.711099999999998,null,null,null,52,635,135.2533,null,"R-Bin04 b",0.98387199999999997,null,635,135.2533]
["T-Bin04 b",1.0586869999999999,"T-Bin04 b",0.96795900000000001,null,53,640,11.090999999999999,null,"R-Bin05 a",-0.114747,null,640,11.090999999999999,null,null,null,53,640,136.874,null,"R-Bin05 a",-8.3003999999999994E-2,null,640,136.874]
["T-Bin05 a",-0.240199,"T-Bin05 a",-5.8271000000000003E-2,null,54,645,10.468299999999999,null,"R-Bin05 b",0.99339500000000003,null,645,10.468299999999999,null,null,null,54,645,136.76070000000001,null,"R-Bin05 b",0.99654900000000002,null,645,136.76070000000001]
["T-Bin05 b",1.085799,"T-Bin05 b",0.96896099999999996,null,55,650,11.261100000000001,null,"R-Bin06 a",-0.55188400000000004,null,650,11.261100000000001,null,null,null,55,650,135.6611,null,"R-Bin06 a",-0.50571299999999997,null,650,135.6611]
["T-Bin06 a",-0.59858800000000001,"T-Bin06 a",-0.49355199999999999,null,56,655,10.1099,null,"R-Bin06 b",0.83392100000000002,null,655,10.1099,null,null,null,56,655,135.64709999999999,null,"R-Bin06 b",0.86270199999999997,null,655,135.64709999999999]
["T-Bin06 b",0.90767900000000001,"T-Bin06 b",0.84621500000000005,null,57,660,8.9038000000000004,null,"R-Bin07 a",-0.85936999999999997,null,660,8.9038000000000004,null,null,null,57,660,138.33260000000001,null,"R-Bin07 a",-0.82126600000000005,null,660,138.33260000000001]
["T-Bin07 a",-0.80181800000000003,"T-Bin07 a",-0.81892799999999999,null,58,665,7.5664999999999996,null,"R-Bin07 b",0.51135399999999998,null,665,7.5664999999999996,null,null,null,58,665,140.4024,null,"R-Bin07 b",0.570546,null,665,140.4024]
["T-Bin07 b",0.60244799999999998,"T-Bin07 b",0.55100300000000002,null,59,670,5.6665999999999999,null,"R-Bin08 a",-0.99066100000000001,null,670,5.6665999999999999,null,null,null,59,670,140.5317,null,"R-Bin08 a",-0.99448300000000001,null,670,140.5317]
["T-Bin08 a",-0.93103199999999997,"T-Bin08 a",-0.99931199999999998,null,60,675,5.3181000000000003,null,"R-Bin08 b",0.13634499999999999,null,675,5.3181000000000003,null,null,null,60,675,139.2987,null,"R-Bin08 b",0.104897,null,675,139.2987]
["T-Bin08 b",0.20987,"T-Bin08 b",8.3733000000000002E-2,null,61,680,5.8703000000000003,null,"R-Bin09 a",-0.99168999999999996,null,680,5.8703000000000003,null,null,null,61,680,134.4425,null,"R-Bin09 a",-0.98467899999999997,null,680,134.4425]
["T-Bin09 a",-0.91706200000000004,"T-Bin09 a",-0.99100999999999995,null,62,685,6.3794000000000004,null,"R-Bin09 b",-0.12865299999999999,null,685,6.3794000000000004,null,null,null,62,685,124.2957,null,"R-Bin09 b",-0.174374,null,685,124.2957]
["T-Bin09 b",-6.1860999999999999E-2,"T-Bin09 b",-0.199576,null,63,690,5.3789999999999996,null,"R-Bin10 a",-0.86387800000000003,null,690,5.3789999999999996,null,null,null,63,690,121.38030000000001,null,"R-Bin10 a",-0.87302000000000002,null,690,121.38030000000001]
["T-Bin10 a",-0.66930000000000001,"T-Bin10 a",-0.88112199999999996,null,64,695,4.6966999999999999,null,"R-Bin10 b",-0.50370099999999995,null,695,4.6966999999999999,null,null,null,64,695,127.535,null,"R-Bin10 b",-0.48768499999999998,null,695,127.535]
["T-Bin10 b",-0.53068199999999999,"T-Bin10 b",-0.49941600000000003,null,65,700,6.7084999999999999,null,"R-Bin11 a",-0.58118099999999995,null,700,6.7084999999999999,null,null,null,65,700,131.08029999999999,null,"R-Bin11 a",-0.569017,null,700,131.08029999999999]
["T-Bin11 a",-0.41098000000000001,"T-Bin11 a",-0.58041600000000004,null,66,{"$f":"IF(INDEX($A$1:$A$500,MATCH(\"Spe*\",$A$1:$A$500,0)+F66)=0,\"\",INDEX($A$1:$A$500,MATCH(\"Spe*\",$A$1:$A$500,0)+F66))","v":705},{"$f":"IF(INDEX($A$1:$A$500,MATCH(\"Spe*\",$A$1:$A$500,0)+F66)=0,\"\",INDEX($B$1:$B$500,MATCH(\"Spe*\",$A$1:$A$500,0)+F66))","v":12.506},null,"R-Bin11 b",-0.813774,null,{"$f":"IF(G66=\"\",NA(),ROUND(G66,0))","v":705},{"$f":"IF(H66=\"\",NA(),H66)","v":12.506},null,null,null,66,{"$f":"IF(INDEX($C$1:$C$500,MATCH(\"Spe*\",$C$1:$C$500,0)+R66)=0,\"\",INDEX($C$1:$C$500,MATCH(\"Spe*\",$C$1:$C$500,0)+R66))","v":705},{"$f":"IF(INDEX($C$1:$C$500,MATCH(\"Spe*\",$C$1:$C$500,0)+R66)=0,\"\",INDEX($D$1:$D$500,MATCH(\"Spe*\",$C$1:$C$500,0)+R66))","v":132.2817},null,"R-Bin11 b",-0.822326,null,{"$f":"IF(S66=\"\",NA(),ROUND(S66,0))","v":705},{"$f":"IF(T66=\"\",NA(),T66)","v":132.2817}]
["T-Bin11 b",-0.84176200000000001,"T-Bin11 b",-0.82807600000000003,null,{"$f":"F66+1","v":67},710,13.231999999999999,null,"R-Bin12 a",-0.32591199999999998,null,710,13.231999999999999,null,null,null,{"$f":"R66+1","v":67},710,129.97929999999999,null,"R-Bin12 a",{"$f":"IF($C$1=\"\",NA(),INDEX($D$1:$D$200,MATCH(V67,$C$1:$C$200,0)))","v":-0.146569},null,710,129.97929999999999]
["T-Bin12 a",-0.24406900000000001,"T-Bin12 a",-0.160887,null,68,715,6.6806999999999999,null,"R-Bin12 b",-0.94540000000000002,null,715,6.6806999999999999,null,null,null,68,715,122.58280000000001,null,"R-Bin12 b",-0.98919999999999997,null,715,122.58280000000001]
["T-Bin12 b",-0.992116,"T-Bin12 b",-0.98280500000000004,null,69,720,2.5350000000000001,null,"R-Bin13 a",0.104308,null,720,2.5350000000000001,null,null,null,69,720,116.0912,null,"R-Bin13 a",0.16619700000000001,null,720,116.0912]
["T-Bin13 a",0.126195,"T-Bin13 a",0.161713,null,70,725,1.5955999999999999,null,"R-Bin13 b",-0.99454500000000001,null,725,1.5955999999999999,null,null,null,70,725,115.7872,null,"R-Bin13 b",-0.986093,null,725,115.7872]
["T-Bin13 b",-1.0635559999999999,"T-Bin13 b",-0.97861500000000001,null,71,730,0.66190000000000004,null,"R-Bin14 a",0.44026500000000002,null,730,0.66190000000000004,null,null,null,71,730,119.2402,null,"R-Bin14 a",0.59516999999999998,null,730,119.2402]
["T-Bin14 a",0.438967,"T-Bin14 a",0.59218599999999999,null,72,735,0.78,null,"R-Bin14 b",-0.897868,null,735,0.78,null,null,null,72,735,124.26479999999999,null,"R-Bin14 b",-0.80359999999999998,null,735,124.26479999999999]
["T-Bin14 b",-0.96736200000000006,"T-Bin14 b",-0.79147699999999999,null,73,740,0.86060000000000003,null,"R-Bin15 a",0.80269800000000002,null,740,0.86060000000000003,null,null,null,73,740,127.0956,null,"R-Bin15 a",0.83299999999999996,null,740,127.0956]
["T-Bin15 a",0.76661500000000005,"T-Bin15 a",0.84584499999999996,null,74,745,0.86499999999999999,null,"R-Bin15 b",-0.59638599999999997,null,745,0.86499999999999999,null,null,null,74,745,127.8921,null,"R-Bin15 b",-0.55327300000000001,null,745,127.8921]
["T-Bin15 b",-0.694774,"T-Bin15 b",-0.54250200000000004,null,75,750,0.23780000000000001,null,"R-Bin16 a",0.98690299999999997,null,750,0.23780000000000001,null,null,null,75,750,122.4545,null,"R-Bin16 a",0.98522600000000005,null,750,122.4545]
["T-Bin16 a",0.94675699999999996,"T-Bin16 a",0.99377599999999999,null,76,755,5.6399999999999999E-2,null,"R-Bin16 b",-0.16131499999999999,null,755,5.6399999999999999E-2,null,null,null,76,755,102.3982,null,"R-Bin16 b",-0.171262,null,755,102.3982]
["T-Bin16 b",-0.259467,"T-Bin16 b",-0.16197700000000001,null,77,760,4.9099999999999998E-2,null,"T-Bin01 a",0.86951199999999995,null,760,4.9099999999999998E-2,null,null,null,77,760,78.126300000000001,null,"T-Bin01 a",0.99664399999999997,null,760,78.126300000000001]
["Rf_Bin01",75,"Rf_Bin01",95,null,78,765,0,null,"T-Bin01 b",0.17516399999999999,null,765,0,null,null,null,78,765,84.557400000000001,null,"T-Bin01 b",0.21485299999999999,null,765,84.557400000000001]
["Rf_Bin02",89,"Rf_Bin02",97,null,79,770,0,null,"T-Bin02 a",0.78391599999999995,null,770,0,null,null,null,79,770,108.9461,null,"T-Bin02 a",0.85506199999999999,null,770,108.9461]
["Rf_Bin03",77,"Rf_Bin03",94,null,80,775,0.10829999999999999,null,"T-Bin02 b",0.567747,null,775,0.10829999999999999,null,null,null,80,775,118.2256,null,"T-Bin02 b",0.54585099999999998,null,775,118.2256]
["Rf_Bin04",70,"Rf_Bin04",95,null,81,780,0,null,"T-Bin03 a",0.44506499999999999,null,780,0,null,null,null,81,780,119.3009,null,"T-Bin03 a",0.56872,null,780,119.3009]
["Rf_Bin05",74,"Rf_Bin05",94,null,82,"","",null,"T-Bin03 b",0.85654399999999997,null,{"$error":"#N/A"},{"$error":"#N/A"},null,null,null,82,"","",null,"T-Bin03 b",0.82856799999999997,null,{"$error":"#N/A"},{"$error":"#N/A"}]
["Rf_Bin06",85,"Rf_Bin06",97,null,83,"","",null,"T-Bin04 a",1.6931999999999999E-2,null,{"$error":"#N/A"},{"$error":"#N/A"},null,null,null,83,"","",null,"T-Bin04 a",0.203288,null,{"$f":"IF(S83=\"\",NA(),ROUND(S83,0))","v":{"$error":"#N/A"}},{"$f":"IF(T83=\"\",NA(),T83)","v":{"$error":"#N/A"}}]
["Rf_Bin07",81,"Rf_Bin07",97,null,84,"","",null,"T-Bin04 b",1.0586869999999999,null,{"$error":"#N/A"},{"$error":"#N/A"},null,null,null,84,"","",null,"T-Bin04 b",0.96795900000000001,null,{"$error":"#N/A"},{"$error":"#N/A"}]
["Rf_Bin08",82,"Rf_Bin08",96,null,85,"","",null,"T-Bin05 a",-0.240199,null,{"$error":"#N/A"},{"$error":"#N/A"},null,null,null,85,"","",null,"T-Bin05 a",-5.8271000000000003E-2,null,{"$error":"#N/A"},{"$error":"#N/A"}]
["Rf_Bin09",85,"Rf_Bin09",97,null,86,"","",null,"T-Bin05 b",1.085799,null,{"$error":"#N/A"},{"$error":"#N/A"},null,null,null,86,"","",null,"T-Bin05 b",0.96896099999999996,null,{"$error":"#N/A"},{"$error":"#N/A"}]
["Rf_Bin10",64,"Rf_Bin10",97,null,87,"","",null,"T-Bin06 a",-0.59858800000000001,null,{"$error":"#N/A"},{"$error":"#N/A"},null,null,null,87,"","",null,"T-Bin06 a",-0.49355199999999999,null,{"$error":"#N/A"},{"$error":"#N/A"}]
["Rf_Bin11",72,"Rf_Bin11",97,null,88,"","",null,"T-Bin06 b",0.90767900000000001,null,{"$error":"#N/A"},{"$error":"#N/A"},null,null,null,88,"","",null,"T-Bin06 b",0.84621500000000005,null,{"$error":"#N/A"},{"$error":"#N/A"}]
["Rf_Bin12",78,"Rf_Bin12",97,null,89,"","",null,"T-Bin07 a",-0.80181800000000003,null,{"$error":"#N/A"},{"$error":"#N/A"},null,null,null,89,"","",null,"T-Bin07 a",-0.81892799999999999,null,{"$error":"#N/A"},{"$error":"#N/A"}]
["Rf_Bin13",84,"Rf_Bin13",98,null,90,"","",null,"T-Bin07 b",0.60244799999999998,null,{"$error":"#N/A"},{"$error":"#N/A"},null,null,null,90,"","",null,"T-Bin07 b",0.55100300000000002,null,{"$error":"#N/A"},{"$error":"#N/A"}]
["Rf_Bin14",78,"Rf_Bin14",97,null,91,"","",null,"T-Bin08 a",-0.93103199999999997,null,{"$error":"#N/A"},{"$error":"#N/A"},null,null,null,91,"","",null,"T-Bin08 a",-0.99931199999999998,null,{"$error":"#N/A"},{"$error":"#N/A"}]
["Rf_Bin15",79,"Rf_Bin15",96,null,92,"","",null,"T-Bin08 b",0.20987,null,{"$error":"#N/A"},{"$error":"#N/A"},null,null,null,92,"","",null,"T-Bin08 b",8.3733000000000002E-2,null,{"$error":"#N/A"},{"$error":"#N/A"}]
["Rf_Bin16",77,"Rf_Bin16",97,null,93,"","",null,"T-Bin09 a",-0.91706200000000004,null,{"$error":"#N/A"},{"$error":"#N/A"},null,null,null,93,"","",null,"T-Bin09 a",-0.99100999999999995,null,{"$error":"#N/A"},{"$error":"#N/A"}]
["Chromashift01 [%]",-11,"Chromashift01 [%]",2,null,94,"","",null,"T-Bin09 b",-6.1860999999999999E-2,null,{"$error":"#N/A"},{"$error":"#N/A"},null,null,null,94,"","",null,"T-Bin09 b",-0.199576,null,{"$error":"#N/A"},{"$error":"#N/A"}]
["Chromashift02 [%]",-3,"Chromashift02 [%]",1,null,95,"","",null,"T-Bin10 a",-0.66930000000000001,null,{"$error":"#N/A"},{"$error":"#N/A"},null,null,null,95,"","",null,"T-Bin10 a",-0.88112199999999996,null,{"$error":"#N/A"},{"$error":"#N/A"}]
["Chromashift03 [%]",-4,"Chromashift03 [%]",1,null,96,"","",null,"T-Bin10 b",-0.53068199999999999,null,{"$error":"#N/A"},{"$error":"#N/A"},null,null,null,96,"","",null,"T-Bin10 b",-0.49941600000000003,null,{"$error":"#N/A"},{"$error":"#N/A"}]
["Chromashift04 [%]",4,"Chromashift04 [%]",-1,null,97,"","",null,"T-Bin11 a",-0.41098000000000001,null,{"$error":"#N/A"},{"$error":"#N/A"},null,null,null,97,"","",null,"T-Bin11 a",-0.58041600000000004,null,{"$error":"#N/A"},{"$error":"#N/A"}]
["Chromashift05 [%]",12,"Chromashift05 [%]",-3,null,98,"","",null,"T-Bin11 b",-0.84176200000000001,null,{"$error":"#N/A"},{"$error":"#N/A"},null,null,null,98,"","",null,"T-Bin11 b",-0.82807600000000003,null,{"$f":"IF(S98=\"\",NA(),ROUND(S98,0))","v":{"$error":"#N/A"}},{"$f":"IF(T98=\"\",NA(),T98)","v":{"$error":"#N/A"}}]
["Chromashift06 [%]",9,"Chromashift06 [%]",-2,null,99,"","",null,"T-Bin12 a",-0.24406900000000001,null,{"$error":"#N/A"},{"$error":"#N/A"},null,null,null,99,"","",null,"T-Bin12 a",-0.160887,null,{"$error":"#N/A"},{"$error":"#N/A"}]
["Chromashift07 [%]",0,"Chromashift07 [%]",-1,null,100,"","",null,"T-Bin12 b",-0.992116,null,{"$error":"#N/A"},{"$error":"#N/A"},null,null,null,100,"","",null,"T-Bin12 b",-0.98280500000000004,null,{"$error":"#N/A"},{"$error":"#N/A"}]
["Chromashift08 [%]",-4,"Chromashift08 [%]",0,null,101,"","",null,"T-Bin13 a",0.126195,null,{"$error":"#N/A"},{"$error":"#N/A"},null,null,null,101,"","",null,"T-Bin13 a",0.161713,null,{"$error":"#N/A"},{"$error":"#N/A"}]
["Chromashift09 [%]",-9,"Chromashift09 [%]",1,null,102,"","",null,"T-Bin13 b",-1.0635559999999999,null,{"$error":"#N/A"},{"$error":"#N/A"},null,null,null,102,"","",null,"T-Bin13 b",-0.97861500000000001,null,{"$error":"#N/A"},{"$error":"#N/A"}]
["Chromashift10 [%]",-15,"Chromashift10 [%]",1,null,103,"","",null,"T-Bin14 a",0.438967,null,{"$error":"#N/A"},{"$error":"#N/A"},null,null,null,103,"","",null,"T-Bin14 a",0.59218599999999999,null,{"$error":"#N/A"},{"$error":"#N/A"}]
["Chromashift11 [%]",-7,"Chromashift11 [%]",1,null,104,"","",null,"T-Bin14 b",-0.96736200000000006,null,{"$error":"#N/A"},{"$error":"#N/A"},null,null,null,104,"","",null,"T-Bin14 b",-0.79147699999999999,null,{"$error":"#N/A"},{"$error":"#N/A"}]
["Chromashift12 [%]",3,"Chromashift12 [%]",0,null,105,"","",null,"T-Bin15 a",0.76661500000000005,null,{"$error":"#N/A"},{"$error":"#N/A"},null,null,null,105,"","",null,"T-Bin15 a",0.84584499999999996,null,{"$error":"#N/A"},{"$error":"#N/A"}]
["Chromashift13 [%]",7,"Chromashift13 [%]",-1,null,106,"","",null,"T-Bin15 b",-0.694774,null,{"$error":"#N/A"},{"$error":"#N/A"},null,null,null,106,"","",null,"T-Bin15 b",-0.54250200000000004,null,{"$error":"#N/A"},{"$error":"#N/A"}]
["Chromashift14 [%]",6,"Chromashift14 [%]",-1,null,107,"","",null,"T-Bin16 a",{"$f":"IF($A$1=\"\",NA(),INDEX($B$1:$B$200,MATCH(J107,$A$1:$A$200,0)))","v":0.94675699999999996},null,{"$error":"#N/A"},{"$error":"#N/A"},null,null,null,107,"","",null,"T-Bin16 a",0.99377599999999999,null,{"$error":"#N/A"},{"$error":"#N/A"}]
["Chromashift15 [%]",2,"Chromashift15 [%]",0,null,108,"","",null,"T-Bin16 b",-0.259467,null,{"$error":"#N/A"},{"$error":"#N/A"},null,null,null,108,"","",null,"T-Bin16 b",-0.16197700000000001,null,{"$error":"#N/A"},{"$error":"#N/A"}]
["Chromashift16 [%]",-2,"Chromashift16 [%]",1,null,109,"","",1,"Rf_Bin01",75,null,{"$error":"#N/A"},{"$error":"#N/A"},null,null,null,109,"","",1,"Rf_Bin01",95,null,{"$error":"#N/A"},{"$error":"#N/A"}]
["Flicker Index",7.2999999999999995E-2,"Flicker Index",0,null,110,"","",2,"Rf_Bin02",89,null,{"$error":"#N/A"},{"$error":"#N/A"},null,null,null,110,"","",2,"Rf_Bin02",97,null,{"$error":"#N/A"},{"$error":"#N/A"}]
["Flicker [Hz]",100,"Flicker [Hz]",0,null,111,"","",3,"Rf_Bin03",77,null,{"$error":"#N/A"},{"$error":"#N/A"},null,null,null,111,"","",3,"Rf_Bin03",94,null,{"$error":"#N/A"},{"$error":"#N/A"}]
["Flicker [%]",25.5,"Flicker [%]",0,null,112,"","",4,"Rf_Bin04",70,null,{"$error":"#N/A"},{"$error":"#N/A"},null,null,null,112,"","",4,"Rf_Bin04",95,null,{"$error":"#N/A"},{"$error":"#N/A"}]
["Ra",79.81,"Ra",96.95,null,113,"","",5,"Rf_Bin05",74,null,{"$error":"#N/A"},{"$error":"#N/A"},null,null,null,113,"","",5,"Rf_Bin05",94,null,{"$error":"#N/A"},{"$error":"#N/A"}]
["Re",70.180000000000007,"Re",95.7,null,114,"","",6,"Rf_Bin06",85,null,{"$error":"#N/A"},{"$error":"#N/A"},null,null,null,114,"","",6,"Rf_Bin06",97,null,{"$error":"#N/A"},{"$error":"#N/A"}]
["GAI",69.14,"GAI",95.1,null,115,"","",7,"Rf_Bin07",81,null,{"$error":"#N/A"},{"$error":"#N/A"},null,null,null,115,"","",7,"Rf_Bin07",97,null,{"$error":"#N/A"},{"$error":"#N/A"}]
["R1",91.71,"R1",96.04,null,116,"","",8,"Rf_Bin08",82,null,{"$error":"#N/A"},{"$error":"#N/A"},null,null,null,116,"","",8,"Rf_Bin08",96,null,{"$error":"#N/A"},{"$error":"#N/A"}]
["R2",88.83,"R2",97.21,null,117,"","",9,"Rf_Bin09",85,null,{"$error":"#N/A"},{"$error":"#N/A"},null,null,null,117,"","",9,"Rf_Bin09",97,null,{"$error":"#N/A"},{"$error":"#N/A"}]
["R3",57.53,"R3",98.85,null,118,"","",10,"Rf_Bin10",64,null,{"$error":"#N/A"},{"$error":"#N/A"},null,null,null,118,"","",10,"Rf_Bin10",97,null,{"$error":"#N/A"},{"$error":"#N/A"}]
["R4",86.75,"R4",96.56,null,119,"","",11,"Rf_Bin11",72,null,{"$error":"#N/A"},{"$error":"#N/A"},null,null,null,119,"","",11,"Rf_Bin11",97,null,{"$error":"#N/A"},{"$error":"#N/A"}]
["R5",81.88,"R5",96.15,null,120,"","",12,"Rf_Bin12",78,null,{"$error":"#N/A"},{"$error":"#N/A"},null,null,null,120,"","",12,"Rf_Bin12",97,null,{"$error":"#N/A"},{"$error":"#N/A"}]
["R6",75.45,"R6",96.64,null,121,"","",13,"Rf_Bin13",84,null,{"$error":"#N/A"},{"$error":"#N/A"},null,null,null,121,"","",13,"Rf_Bin13",98,null,{"$error":"#N/A"},{"$error":"#N/A"}]
["R7",88.44,"R7",98.87,null,122,"","",14,"Rf_Bin14",78,null,{"$error":"#N/A"},{"$error":"#N/A"},null,null,null,122,"","",14,"Rf_Bin14",97,null,{"$error":"#N/A"},{"$error":"#N/A"}]
["R8",67.86,"R8",95.27,null,123,"","",15,"Rf_Bin15",79,null,{"$error":"#N/A"},{"$error":"#N/A"},null,null,null,123,"","",15,"Rf_Bin15",96,null,{"$error":"#N/A"},{"$error":"#N/A"}]
["R9",-4.37,"R9",85.8,null,124,"","",16,"Rf_Bin16",77,null,{"$error":"#N/A"},{"$error":"#N/A"},null,null,null,124,"","",16,"Rf_Bin16",97,null,{"$error":"#N/A"},{"$error":"#N/A"}]
["R10",44.54,"R10",93.74,null,125,"","",1,"Chromashift01 [%]",-11,null,{"$error":"#N/A"},{"$error":"#N/A"},null,null,null,125,"","",1,"Chromashift01 [%]",2,null,{"$error":"#N/A"},{"$error":"#N/A"}]
["R11",71.98,"R11",95.73,null,126,"","",2,"Chromashift02 [%]",-3,null,{"$error":"#N/A"},{"$error":"#N/A"},null,null,null,126,"","",2,"Chromashift02 [%]",1,null,{"$error":"#N/A"},{"$error":"#N/A"}]
["R12",49.3,"R12",94.14,null,127,"","",3,"Chromashift03 [%]",-4,null,{"$error":"#N/A"},{"$error":"#N/A"},null,null,null,127,"","",3,"Chromashift03 [%]",1,null,{"$error":"#N/A"},{"$error":"#N/A"}]
["R13",92.95,"R13",96.08,null,128,"","",4,"Chromashift04 [%]",4,null,{"$error":"#N/A"},{"$error":"#N/A"},null,null,null,128,"","",4,"Chromashift04 [%]",-1,null,{"$error":"#N/A"},{"$error":"#N/A"}]
["R14",71.88,"R14",99.31,null,129,"","",5,"Chromashift05 [%]",12,null,{"$error":"#N/A"},{"$error":"#N/A"},null,null,null,129,"","",5,"Chromashift05 [%]",-3,null,{"$error":"#N/A"},{"$error":"#N/A"}]
["R15",88.02,"R15",95.11,null,130,{"$f":"IF(INDEX($A$1:$A$500,MATCH(\"Spe*\",$A$1:$A$500,0)+F130)=0,\"\",INDEX($A$1:$A$500,MATCH(\"Spe*\",$A$1:$A$500,0)+F130))","v":""},{"$f":"IF(INDEX($A$1:$A$500,MATCH(\"Spe*\",$A$1:$A$500,0)+F130)=0,\"\",INDEX($B$1:$B$500,MATCH(\"Spe*\",$A$1:$A$500,0)+F130))","v":""},6,"Chromashift06 [%]",9,null,{"$f":"IF(G130=\"\",NA(),ROUND(G130,0))","v":{"$error":"#N/A"}},{"$f":"IF(H130=\"\",NA(),H130)","v":{"$error":"#N/A"}},null,null,null,130,{"$f":"IF(INDEX($C$1:$C$500,MATCH(\"Spe*\",$C$1:$C$500,0)+R130)=0,\"\",INDEX($C$1:$C$500,MATCH(\"Spe*\",$C$1:$C$500,0)+R130))","v":""},{"$f":"IF(INDEX($C$1:$C$500,MATCH(\"Spe*\",$C$1:$C$500,0)+R130)=0,\"\",INDEX($D$1:$D$500,MATCH(\"Spe*\",$C$1:$C$500,0)+R130))","v":""},6,"Chromashift06 [%]",-2,null,{"$error":"#N/A"},{"$error":"#N/A"}]
["x",0.39400000000000002,"x",0.3337,null,{"$f":"F130+1","v":131},"","",7,"Chromashift07 [%]",0,null,{"$error":"#N/A"},{"$error":"#N/A"},null,null,null,{"$f":"R130+1","v":131},"","",7,"Chromashift07 [%]",{"$f":"IF($C$1=\"\",NA(),INDEX($D$1:$D$200,MATCH(V131,$C$1:$C$200,0)))","v":-1},null,{"$error":"#N/A"},{"$error":"#N/A"}]
["y",0.39760000000000001,"y",0.34370000000000001,null,132,"","",8,"Chromashift08 [%]",-4,null,{"$error":"#N/A"},{"$error":"#N/A"},null,null,null,132,"","",8,"Chromashift08 [%]",0,null,{"$error":"#N/A"},{"$error":"#N/A"}]
["u'",0.22570000000000001,"u'",0.20669999999999999,null,133,"","",9,"Chromashift09 [%]",-9,null,{"$error":"#N/A"},{"$error":"#N/A"},null,null,null,133,"","",9,"Chromashift09 [%]",1,null,{"$error":"#N/A"},{"$error":"#N/A"}]
["v'",0.51239999999999997,"v'",0.47899999999999998,null,134,"","",10,"Chromashift10 [%]",-15,null,{"$error":"#N/A"},{"$error":"#N/A"},null,null,null,134,"","",10,"Chromashift10 [%]",1,null,{"$error":"#N/A"},{"$error":"#N/A"}]
["u",0.22570000000000001,"u",0.20669999999999999,null,135,"","",11,"Chromashift11 [%]",-7,null,{"$error":"#N/A"},{"$error":"#N/A"},null,null,null,135,"","",11,"Chromashift11 [%]",1,null,{"$error":"#N/A"},{"$error":"#N/A"}]
["v",0.34160000000000001,"v",0.31940000000000002,null,136,"","",12,"Chromashift12 [%]",3,null,{"$error":"#N/A"},{"$error":"#N/A"},null,null,null,136,"","",12,"Chromashift12 [%]",0,null,{"$error":"#N/A"},{"$error":"#N/A"}]
["Lambda Peak [nm]",543,"Lambda Peak [nm]",477,null,137,"","",13,"Chromashift13 [%]",7,null,{"$error":"#N/A"},{"$error":"#N/A"},null,null,null,137,"","",13,"Chromashift13 [%]",-1,null,{"$error":"#N/A"},{"$error":"#N/A"}]
["Lambda Peak",168576.39,"Lambda Peak",144880.75,null,138,"","",14,"Chromashift14 [%]",6,null,{"$error":"#N/A"},{"$error":"#N/A"},null,null,null,138,"","",14,"Chromashift14 [%]",-1,null,{"$error":"#N/A"},{"$error":"#N/A"}]
["Farbreinheit [%]",37.5,"Farbreinheit [%]",3.2,null,139,"","",15,"Chromashift15 [%]",2,null,{"$error":"#N/A"},{"$error":"#N/A"},null,null,null,139,"","",15,"Chromashift15 [%]",0,null,{"$error":"#N/A"},{"$error":"#N/A"}]
["Dominante Wellenlänge [nm]",577,"Dominante Wellenl‰nge [nm]",555,null,140,"","",16,"Chromashift16 [%]",-2,null,{"$error":"#N/A"},{"$error":"#N/A"},null,null,null,140,"","",16,"Chromashift16 [%]",1,null,{"$error":"#N/A"},{"$error":"#N/A"}]
[null,null,null,null,null,141,"","",null,null,null,null,{"$error":"#N/A"},{"$error":"#N/A"},null,null,null,141,"","",null,null,null,null,{"$error":"#N/A"},{"$error":"#N/A"}]
["Auflösung","5 nm","Auflˆsung",5,null,142,"","",null,null,null,null,{"$error":"#N/A"},{"$error":"#N/A"},null,null,null,142,"","",null,null,null,null,{"$error":"#N/A"},{"$error":"#N/A"}]
["Spektrum in [nm]","mW/m²/nm","Spektrum in [nm]",0,null,143,"","",null,null,null,null,{"$error":"#N/A"},{"$error":"#N/A"},null,null,null,143,"","",null,null,null,null,{"$error":"#N/A"},{"$error":"#N/A"}]
[380,0.57240000000000002,380,42.606900000000003,null,144,"","",null,null,null,null,{"$error":"#N/A"},{"$error":"#N/A"},null,null,null,144,"","",null,null,null,null,{"$error":"#N/A"},{"$error":"#N/A"}]
[385,0.20680000000000001,385,44.198099999999997,null,145,"","",null,null,null,null,{"$error":"#N/A"},{"$error":"#N/A"},null,null,null,145,"","",null,null,null,null,{"$error":"#N/A"},{"$error":"#N/A"}]
[390,0.46150000000000002,390,48.4497,null,146,"","",null,null,null,null,{"$error":"#N/A"},{"$error":"#N/A"},null,null,null,146,"","",null,null,null,null,{"$error":"#N/A"},{"$error":"#N/A"}]
[395,1.4525999999999999,395,59.812899999999999,null,147,"","",null,null,null,null,{"$error":"#N/A"},{"$error":"#N/A"},null,null,null,147,"","",null,null,null,null,{"$error":"#N/A"},{"$error":"#N/A"}]
[400,15.3386,400,79.426900000000003,null,148,"","",null,null,null,null,{"$error":"#N/A"},{"$error":"#N/A"},null,null,null,148,"","",null,null,null,null,{"$error":"#N/A"},{"$error":"#N/A"}]
[405,19.5168,405,88.917500000000004,null,149,"","",null,null,null,null,{"$error":"#N/A"},{"$error":"#N/A"},null,null,null,149,"","",null,null,null,null,{"$error":"#N/A"},{"$error":"#N/A"}]
[410,7.0986000000000002,410,94.227699999999999,null,150,"","",null,null,null,null,{"$error":"#N/A"},{"$error":"#N/A"},null,null,null,150,"","",null,null,null,null,{"$error":"#N/A"},{"$error":"#N/A"}]
[415,5.8689,415,98.613500000000002,null,151,"","",null,null,null,null,{"$error":"#N/A"},{"$error":"#N/A"},null,null,null,151,"","",null,null,null,null,{"$error":"#N/A"},{"$error":"#N/A"}]
[420,8.2623999999999995,420,100.07470000000001,null,152,"","",null,null,null,null,{"$error":"#N/A"},{"$error":"#N/A"},null,null,null,152,"","",null,null,null,null,{"$error":"#N/A"},{"$error":"#N/A"}]
[425,11.879099999999999,425,98.543899999999994,null,153,"","",null,null,null,null,{"$error":"#N/A"},{"$error":"#N/A"},null,null,null,153,"","",null,null,null,null,{"$error":"#N/A"},{"$error":"#N/A"}]
[430,41.239100000000001,430,100.3488,null,154,"","",null,null,null,null,{"$error":"#N/A"},{"$error":"#N/A"},null,null,null,154,"","",null,null,null,null,{"$error":"#N/A"},{"$error":"#N/A"}]
[435,64.129900000000006,435,110.0917,null,155,"","",null,null,null,null,{"$error":"#N/A"},{"$error":"#N/A"},null,null,null,155,"","",null,null,null,null,{"$error":"#N/A"},{"$error":"#N/A"}]
[440,32.883200000000002,440,119.6392,null,156,"","",null,null,null,null,{"$error":"#N/A"},{"$error":"#N/A"},null,null,null,156,"","",null,null,null,null,{"$error":"#N/A"},{"$error":"#N/A"}]
[445,18.284300000000002,445,128.72730000000001,null,157,"","",null,null,null,null,{"$error":"#N/A"},{"$error":"#N/A"},null,null,null,157,"","",null,null,null,null,{"$error":"#N/A"},{"$error":"#N/A"}]
[450,18.1922,450,135.43520000000001,null,158,"","",null,null,null,null,{"$error":"#N/A"},{"$error":"#N/A"},null,null,null,158,"","",null,null,null,null,{"$error":"#N/A"},{"$error":"#N/A"}]
[455,17.9373,455,138.93799999999999,null,159,"","",null,null,null,null,{"$error":"#N/A"},{"$error":"#N/A"},null,null,null,159,"","",null,null,null,null,{"$error":"#N/A"},{"$error":"#N/A"}]
[460,16.9191,460,142.422,null,160,"","",null,null,null,null,{"$error":"#N/A"},{"$error":"#N/A"},null,null,null,160,"","",null,null,null,null,{"$error":"#N/A"},{"$error":"#N/A"}]
[465,15.5221,465,142.47620000000001,null,161,"","",null,null,null,null,{"$error":"#N/A"},{"$error":"#N/A"},null,null,null,161,"","",null,null,null,null,{"$error":"#N/A"},{"$error":"#N/A"}]
[470,14.143000000000001,470,142.67830000000001,null,162,"","",null,null,null,null,{"$error":"#N/A"},{"$error":"#N/A"},null,null,null,162,"","",null,null,null,null,{"$f":"IF(S162=\"\",NA(),ROUND(S162,0))","v":{"$error":"#N/A"}},{"$f":"IF(T162=\"\",NA(),T162)","v":{"$error":"#N/A"}}]
[475,14.642799999999999,475,144.50649999999999,null,163,"","",null,null,null,null,{"$error":"#N/A"},{"$error":"#N/A"},null,null,null,163,"","",null,null,null,null,{"$error":"#N/A"},{"$error":"#N/A"}]
[480,24.472799999999999,480,143.83430000000001,null,164,"","",null,null,null,null,{"$error":"#N/A"},{"$error":"#N/A"},null,null,null,164,"","",null,null,null,null,{"$error":"#N/A"},{"$error":"#N/A"}]
[485,39.417099999999998,485,140.54050000000001,null,165,"","",null,null,null,null,{"$error":"#N/A"},{"$error":"#N/A"},null,null,null,165,"","",null,null,null,null,{"$error":"#N/A"},{"$error":"#N/A"}]
[490,36.798900000000003,490,142.1223,null,166,"","",null,null,null,null,{"$error":"#N/A"},{"$error":"#N/A"},null,null,null,166,"","",null,null,null,null,{"$error":"#N/A"},{"$error":"#N/A"}]
[495,23.702999999999999,495,143.5925,null,167,"","",null,null,null,null,{"$error":"#N/A"},{"$error":"#N/A"},null,null,null,167,"","",null,null,null,null,{"$error":"#N/A"},{"$error":"#N/A"}]
[500,13.5647,500,142.37469999999999,null,168,"","",null,null,null,null,{"$error":"#N/A"},{"$error":"#N/A"},null,null,null,168,"","",null,null,null,null,{"$error":"#N/A"},{"$error":"#N/A"}]
[505,8.2264999999999997,505,143.08670000000001,null,169,"","",null,null,null,null,{"$error":"#N/A"},{"$error":"#N/A"},null,null,null,169,"","",null,null,null,null,{"$error":"#N/A"},{"$error":"#N/A"}]
[510,6.1430999999999996,510,142.2774,null,170,"","",null,null,null,null,{"$error":"#N/A"},{"$error":"#N/A"},null,null,null,170,"","",null,null,null,null,{"$error":"#N/A"},{"$error":"#N/A"}]
[515,5.6165000000000003,515,138.19059999999999,null,171,"","",null,null,null,null,{"$error":"#N/A"},{"$error":"#N/A"},null,null,null,171,"","",null,null,null,null,{"$error":"#N/A"},{"$error":"#N/A"}]
[520,5.7843,520,138.24170000000001,null,172,"","",null,null,null,null,{"$error":"#N/A"},{"$error":"#N/A"},null,null,null,172,"","",null,null,null,null,{"$error":"#N/A"},{"$error":"#N/A"}]
[525,7.9572000000000003,525,139.9675,null,173,"","",null,null,null,null,{"$error":"#N/A"},{"$error":"#N/A"},null,null,null,173,"","",null,null,null,null,{"$error":"#N/A"},{"$error":"#N/A"}]
[530,17.520900000000001,530,140.9057,null,174,"","",null,null,null,null,{"$error":"#N/A"},{"$error":"#N/A"},null,null,null,174,"","",null,null,null,null,{"$error":"#N/A"},{"$error":"#N/A"}]
[535,56.848999999999997,535,140.9872,null,175,"","",null,null,null,null,{"$error":"#N/A"},{"$error":"#N/A"},null,null,null,175,"","",null,null,null,null,{"$error":"#N/A"},{"$error":"#N/A"}]
[540,139.41669999999999,540,140.2766,null,176,"","",null,null,null,null,{"$error":"#N/A"},{"$error":"#N/A"},null,null,null,176,"","",null,null,null,null,{"$error":"#N/A"},{"$error":"#N/A"}]
[545,160.0821,545,140.2628,null,177,"","",null,null,null,null,{"$error":"#N/A"},{"$error":"#N/A"},null,null,null,177,"","",null,null,null,null,{"$error":"#N/A"},{"$error":"#N/A"}]
[550,86.403199999999998,550,139.6259,null,178,"","",null,null,null,null,{"$error":"#N/A"},{"$error":"#N/A"},null,null,null,178,"","",null,null,null,null,{"$error":"#N/A"},{"$error":"#N/A"}]
[555,32.056899999999999,555,138.0119,null,179,"","",null,null,null,null,{"$error":"#N/A"},{"$error":"#N/A"},null,null,null,179,"","",null,null,null,null,{"$error":"#N/A"},{"$error":"#N/A"}]
[560,16.082100000000001,560,135.1609,null,180,"","",null,null,null,null,{"$error":"#N/A"},{"$error":"#N/A"},null,null,null,180,"","",null,null,null,null,{"$error":"#N/A"},{"$error":"#N/A"}]
[565,13.2568,565,132.79490000000001,null,181,"","",null,null,null,null,{"$error":"#N/A"},{"$error":"#N/A"},null,null,null,181,"","",null,null,null,null,{"$error":"#N/A"},{"$error":"#N/A"}]
[570,15.9605,570,130.65530000000001,null,182,"","",null,null,null,null,{"$error":"#N/A"},{"$error":"#N/A"},null,null,null,182,"","",null,null,null,null,{"$error":"#N/A"},{"$error":"#N/A"}]
[575,28.370899999999999,575,130.70580000000001,null,183,"","",null,null,null,null,{"$error":"#N/A"},{"$error":"#N/A"},null,null,null,183,"","",null,null,null,null,{"$error":"#N/A"},{"$error":"#N/A"}]
[580,42.883899999999997,580,132.81399999999999,null,184,"","",null,null,null,null,{"$error":"#N/A"},{"$error":"#N/A"},null,null,null,184,"","",null,null,null,null,{"$error":"#N/A"},{"$error":"#N/A"}]
[585,47.615900000000003,585,133.1275,null,185,"","",null,null,null,null,{"$error":"#N/A"},{"$error":"#N/A"},null,null,null,185,"","",null,null,null,null,{"$error":"#N/A"},{"$error":"#N/A"}]
[590,43.179000000000002,590,131.76060000000001,null,186,"","",null,null,null,null,{"$error":"#N/A"},{"$error":"#N/A"},null,null,null,186,"","",null,null,null,null,{"$error":"#N/A"},{"$error":"#N/A"}]
[595,36.741199999999999,595,131.8843,null,187,"","",null,null,null,null,{"$error":"#N/A"},{"$error":"#N/A"},null,null,null,187,"","",null,null,null,null,{"$error":"#N/A"},{"$error":"#N/A"}]
[600,37.325099999999999,600,132.66069999999999,null,188,"","",null,null,null,null,{"$error":"#N/A"},{"$error":"#N/A"},null,null,null,188,"","",null,null,null,null,{"$error":"#N/A"},{"$error":"#N/A"}]
[605,78.079499999999996,605,133.4066,null,189,"","",null,null,null,null,{"$error":"#N/A"},{"$error":"#N/A"},null,null,null,189,"","",null,null,null,null,{"$error":"#N/A"},{"$error":"#N/A"}]
[610,135.84289999999999,610,133.0814,null,190,"","",null,null,null,null,{"$error":"#N/A"},{"$error":"#N/A"},null,null,null,190,"","",null,null,null,null,{"$error":"#N/A"},{"$error":"#N/A"}]
[615,105.47709999999999,615,132.9246,null,191,"","",null,null,null,null,{"$error":"#N/A"},{"$error":"#N/A"},null,null,null,191,"","",null,null,null,null,{"$error":"#N/A"},{"$error":"#N/A"}]
[620,55.517299999999999,620,133.13050000000001,null,192,"","",null,null,null,null,{"$error":"#N/A"},{"$error":"#N/A"},null,null,null,192,"","",null,null,null,null,{"$error":"#N/A"},{"$error":"#N/A"}]
[625,43.192900000000002,625,131.8954,null,193,"","",null,null,null,null,{"$error":"#N/A"},{"$error":"#N/A"},null,null,null,193,"","",null,null,null,null,{"$error":"#N/A"},{"$error":"#N/A"}]
[630,33.598399999999998,630,132.32689999999999,null,194,{"$f":"IF(INDEX($A$1:$A$500,MATCH(\"Spe*\",$A$1:$A$500,0)+F194)=0,\"\",INDEX($A$1:$A$500,MATCH(\"Spe*\",$A$1:$A$500,0)+F194))","v":""},{"$f":"IF(INDEX($A$1:$A$500,MATCH(\"Spe*\",$A$1:$A$500,0)+F194)=0,\"\",INDEX($B$1:$B$500,MATCH(\"Spe*\",$A$1:$A$500,0)+F194))","v":""},null,null,null,null,{"$f":"IF(G194=\"\",NA(),ROUND(G194,0))","v":{"$error":"#N/A"}},{"$f":"IF(H194=\"\",NA(),H194)","v":{"$error":"#N/A"}},null,null,null,194,{"$f":"IF(INDEX($C$1:$C$500,MATCH(\"Spe*\",$C$1:$C$500,0)+R194)=0,\"\",INDEX($C$1:$C$500,MATCH(\"Spe*\",$C$1:$C$500,0)+R194))","v":""},{"$f":"IF(INDEX($C$1:$C$500,MATCH(\"Spe*\",$C$1:$C$500,0)+R194)=0,\"\",INDEX($D$1:$D$500,MATCH(\"Spe*\",$C$1:$C$500,0)+R194))","v":""},null,null,null,null,{"$error":"#N/A"},{"$error":"#N/A"}]
[635,18.711099999999998,635,135.2533,null,{"$f":"F194+1","v":195},"","",null,null,null,null,{"$error":"#N/A"},{"$error":"#N/A"},null,null,null,{"$f":"R194+1","v":195},"","",null,null,null,null,{"$error":"#N/A"},{"$error":"#N/A"}]
[640,11.090999999999999,640,136.874,null,196,"","",null,null,null,null,{"$error":"#N/A"},{"$error":"#N/A"},null,null,null,196,"","",null,null,null,null,{"$error":"#N/A"},{"$error":"#N/A"}]
[645,10.468299999999999,645,136.76070000000001,null,197,"","",null,null,null,null,{"$error":"#N/A"},{"$error":"#N/A"},null,null,null,197,"","",null,null,null,null,{"$error":"#N/A"},{"$error":"#N/A"}]
[650,11.261100000000001,650,135.6611,null,198,"","",null,null,null,null,{"$error":"#N/A"},{"$error":"#N/A"},null,null,null,198,"","",null,null,null,null,{"$error":"#N/A"},{"$error":"#N/A"}]
[655,10.1099,655,135.64709999999999,null,199,"","",null,null,null,null,{"$error":"#N/A"},{"$error":"#N/A"},null,null,null,199,"","",null,null,null,null,{"$error":"#N/A"},{"$error":"#N/A"}]
[660,8.9038000000000004,660,138.33260000000001,null,200,"","",null,null,null,null,{"$error":"#N/A"},{"$error":"#N/A"},null,null,null,200,"","",null,null,null,null,{"$error":"#N/A"},{"$error":"#N/A"}]
[665,7.5664999999999996,665,140.4024,null,201,"","",null,null,null,null,{"$error":"#N/A"},{"$error":"#N/A"},null,null,null,201,"","",null,null,null,null,{"$error":"#N/A"},{"$error":"#N/A"}]
[670,5.6665999999999999,670,140.5317,null,202,"","",null,null,null,null,{"$error":"#N/A"},{"$error":"#N/A"},null,null,null,202,"","",null,null,null,null,{"$error":"#N/A"},{"$error":"#N/A"}]
[675,5.3181000000000003,675,139.2987,null,203,"","",null,null,null,null,{"$error":"#N/A"},{"$error":"#N/A"},null,null,null,203,"","",null,null,null,null,{"$error":"#N/A"},{"$error":"#N/A"}]
[680,5.8703000000000003,680,134.4425,null,204,"","",null,null,null,null,{"$error":"#N/A"},{"$error":"#N/A"},null,null,null,204,"","",null,null,null,null,{"$error":"#N/A"},{"$error":"#N/A"}]
[685,6.3794000000000004,685,124.2957,null,205,"","",null,null,null,null,{"$error":"#N/A"},{"$error":"#N/A"},null,null,null,205,"","",null,null,null,null,{"$error":"#N/A"},{"$error":"#N/A"}]
[690,5.3789999999999996,690,121.38030000000001,null,206,"","",null,null,null,null,{"$error":"#N/A"},{"$error":"#N/A"},null,null,null,206,"","",null,null,null,null,{"$error":"#N/A"},{"$error":"#N/A"}]
[695,4.6966999999999999,695,127.535,null,207,"","",null,null,null,null,{"$error":"#N/A"},{"$error":"#N/A"},null,null,null,207,"","",null,null,null,null,{"$error":"#N/A"},{"$error":"#N/A"}]
[700,6.7084999999999999,700,131.08029999999999,null,208,"","",null,null,null,null,{"$error":"#N/A"},{"$error":"#N/A"},null,null,null,208,"","",null,null,null,null,{"$error":"#N/A"},{"$error":"#N/A"}]
[705,12.506,705,132.2817,null,209,"","",null,null,null,null,{"$error":"#N/A"},{"$error":"#N/A"},null,null,null,209,"","",null,null,null,null,{"$error":"#N/A"},{"$error":"#N/A"}]
[710,13.231999999999999,710,129.97929999999999,null,210,"","",null,null,null,null,{"$error":"#N/A"},{"$error":"#N/A"},null,null,null,210,"","",null,null,null,null,{"$error":"#N/A"},{"$error":"#N/A"}]
[715,6.6806999999999999,715,122.58280000000001,null,211,"","",null,null,null,null,{"$error":"#N/A"},{"$error":"#N/A"},null,null,null,211,"","",null,null,null,null,{"$error":"#N/A"},{"$error":"#N/A"}]
[720,2.5350000000000001,720,116.0912,null,212,"","",null,null,null,null,{"$error":"#N/A"},{"$error":"#N/A"},null,null,null,212,"","",null,null,null,null,{"$error":"#N/A"},{"$error":"#N/A"}]
[725,1.5955999999999999,725,115.7872,null,213,"","",null,null,null,null,{"$error":"#N/A"},{"$error":"#N/A"},null,null,null,213,"","",null,null,null,null,{"$error":"#N/A"},{"$error":"#N/A"}]
[730,0.66190000000000004,730,119.2402,null,214,"","",null,null,null,null,{"$error":"#N/A"},{"$error":"#N/A"},null,null,null,214,"","",null,null,null,null,{"$error":"#N/A"},{"$error":"#N/A"}]
[735,0.78,735,124.26479999999999,null,215,"","",null,null,null,null,{"$error":"#N/A"},{"$error":"#N/A"},null,null,null,215,"","",null,null,null,null,{"$error":"#N/A"},{"$error":"#N/A"}]
[740,0.86060000000000003,740,127.0956,null,216,"","",null,null,null,null,{"$error":"#N/A"},{"$error":"#N/A"},null,null,null,216,"","",null,null,null,null,{"$error":"#N/A"},{"$error":"#N/A"}]
[745,0.86499999999999999,745,127.8921,null,217,"","",null,null,null,null,{"$error":"#N/A"},{"$error":"#N/A"},null,null,null,217,"","",null,null,null,null,{"$error":"#N/A"},{"$error":"#N/A"}]
[750,0.23780000000000001,750,122.4545,null,218,"","",null,null,null,null,{"$error":"#N/A"},{"$error":"#N/A"},null,null,null,218,"","",null,null,null,null,{"$error":"#N/A"},{"$error":"#N/A"}]
[755,5.6399999999999999E-2,755,102.3982,null,219,"","",null,null,null,null,{"$error":"#N/A"},{"$error":"#N/A"},null,null,null,219,"","",null,null,null,null,{"$error":"#N/A"},{"$error":"#N/A"}]
[760,4.9099999999999998E-2,760,78.126300000000001,null,220,"","",null,null,null,null,{"$error":"#N/A"},{"$error":"#N/A"},null,null,null,220,"","",null,null,null,null,{"$error":"#N/A"},{"$error":"#N/A"}]
[765,0,765,84.557400000000001,null,221,"","",null,null,null,null,{"$error":"#N/A"},{"$error":"#N/A"},null,null,null,221,"","",null,null,null,null,{"$error":"#N/A"},{"$error":"#N/A"}]
[770,0,770,108.9461,null,222,"","",null,null,null,null,{"$error":"#N/A"},{"$error":"#N/A"},null,null,null,222,"","",null,null,null,null,{"$error":"#N/A"},{"$error":"#N/A"}]
[775,0.10829999999999999,775,118.2256,null,223,"","",null,null,null,null,{"$error":"#N/A"},{"$error":"#N/A"},null,null,null,223,"","",null,null,null,null,{"$error":"#N/A"},{"$error":"#N/A"}]
[780,0,780,119.3009,null,224,"","",null,null,null,null,{"$error":"#N/A"},{"$error":"#N/A"},null,null,null,224,"","",null,null,null,null,{"$error":"#N/A"},{"$error":"#N/A"}]
[null,null,null,null,null,225,"","",null,null,null,null,{"$error":"#N/A"},{"$error":"#N/A"},null,null,null,225,"","",null,null,null,null,{"$error":"#N/A"},{"$error":"#N/A"}]
[null,null,null,null,null,226,"","",null,null,null,null,{"$error":"#N/A"},{"$error":"#N/A"},null,null,null,226,"","",null,null,null,null,{"$f":"IF(S226=\"\",NA(),ROUND(S226,0))","v":{"$error":"#N/A"}},{"$f":"IF(T226=\"\",NA(),T226)","v":{"$error":"#N/A"}}]
[null,null,null,null,null,227,"","",null,null,null,null,{"$error":"#N/A"},{"$error":"#N/A"},null,null,null,227,"","",null,null,null,null,{"$error":"#N/A"},{"$error":"#N/A"}]
[null,null,null,null,null,228,"","",null,null,null,null,{"$error":"#N/A"},{"$error":"#N/A"},null,null,null,228,"","",null,null,null,null,{"$error":"#N/A"},{"$error":"#N/A"}]
[null,null,null,null,null,229,"","",null,null,null,null,{"$error":"#N/A"},{"$error":"#N/A"},null,null,null,229,"","",null,null,null,null,{"$error":"#N/A"},{"$error":"#N/A"}]
[null,null,null,null,null,230,"","",null,null,null,null,{"$error":"#N/A"},{"$error":"#N/A"},null,null,null,230,"","",null,null,null,null,{"$error":"#N/A"},{"$error":"#N/A"}]
[null,null,null,null,null,231,"","",null,null,null,null,{"$error":"#N/A"},{"$error":"#N/A"},null,null,null,231,"","",null,null,null,null,{"$error":"#N/A"},{"$error":"#N/A"}]
[null,null,null,null,null,232,"","",null,null,null,null,{"$error":"#N/A"},{"$error":"#N/A"},null,null,null,232,"","",null,null,null,null,{"$error":"#N/A"},{"$error":"#N/A"}]
[null,null,null,null,null,233,"","",null,null,null,null,{"$error":"#N/A"},{"$error":"#N/A"},null,null,null,233,"","",null,null,null,null,{"$error":"#N/A"},{"$error":"#N/A"}]
[null,null,null,null,null,234,"","",null,null,null,null,{"$error":"#N/A"},{"$error":"#N/A"},null,null,null,234,"","",null,null,null,null,{"$error":"#N/A"},{"$error":"#N/A"}]
[null,null,null,null,null,235,"","",null,null,null,null,{"$error":"#N/A"},{"$error":"#N/A"},null,null,null,235,"","",null,null,null,null,{"$error":"#N/A"},{"$error":"#N/A"}]
[null,null,null,null,null,236,"","",null,null,null,null,{"$error":"#N/A"},{"$error":"#N/A"},null,null,null,236,"","",null,null,null,null,{"$error":"#N/A"},{"$error":"#N/A"}]
[null,null,null,null,null,237,"","",null,null,null,null,{"$error":"#N/A"},{"$error":"#N/A"},null,null,null,237,"","",null,null,null,null,{"$error":"#N/A"},{"$error":"#N/A"}]
[null,null,null,null,null,238,"","",null,null,null,null,{"$error":"#N/A"},{"$error":"#N/A"},null,null,null,238,"","",null,null,null,null,{"$error":"#N/A"},{"$error":"#N/A"}]
[null,null,null,null,null,239,"","",null,null,null,null,{"$error":"#N/A"},{"$error":"#N/A"},null,null,null,239,"","",null,null,null,null,{"$error":"#N/A"},{"$error":"#N/A"}]
[null,null,null,null,null,240,"","",null,null,null,null,{"$error":"#N/A"},{"$error":"#N/A"},null,null,null,240,"","",null,null,null,null,{"$error":"#N/A"},{"$error":"#N/A"}]
[null,null,null,null,null,241,"","",null,null,null,null,{"$error":"#N/A"},{"$error":"#N/A"},null,null,null,241,"","",null,null,null,null,{"$error":"#N/A"},{"$error":"#N/A"}]
[null,null,null,null,null,242,"","",null,null,null,null,{"$error":"#N/A"},{"$error":"#N/A"},null,null,null,242,"","",null,null,null,null,{"$error":"#N/A"},{"$error":"#N/A"}]
[null,null,null,null,null,243,"","",null,null,null,null,{"$error":"#N/A"},{"$error":"#N/A"},null,null,null,243,"","",null,null,null,null,{"$error":"#N/A"},{"$error":"#N/A"}]
[null,null,null,null,null,244,"","",null,null,null,null,{"$error":"#N/A"},{"$error":"#N/A"},null,null,null,244,"","",null,null,null,null,{"$error":"#N/A"},{"$error":"#N/A"}]
[null,null,null,null,null,245,"","",null,null,null,null,{"$error":"#N/A"},{"$error":"#N/A"},null,null,null,245,"","",null,null,null,null,{"$error":"#N/A"},{"$error":"#N/A"}]
[null,null,null,null,null,246,"","",null,null,null,null,{"$error":"#N/A"},{"$error":"#N/A"},null,null,null,246,"","",null,null,null,null,{"$error":"#N/A"},{"$error":"#N/A"}]
[null,null,null,null,null,247,"","",null,null,null,null,{"$error":"#N/A"},{"$error":"#N/A"},null,null,null,247,"","",null,null,null,null,{"$error":"#N/A"},{"$error":"#N/A"}]
[null,null,null,null,null,248,"","",null,null,null,null,{"$error":"#N/A"},{"$error":"#N/A"},null,null,null,248,"","",null,null,null,null,{"$error":"#N/A"},{"$error":"#N/A"}]
[null,null,null,null,null,249,"","",null,null,null,null,{"$error":"#N/A"},{"$error":"#N/A"},null,null,null,249,"","",null,null,null,null,{"$error":"#N/A"},{"$error":"#N/A"}]
[null,null,null,null,null,250,"","",null,null,null,null,{"$error":"#N/A"},{"$error":"#N/A"},null,null,null,250,"","",null,null,null,null,{"$error":"#N/A"},{"$error":"#N/A"}]
[null,null,null,null,null,251,"","",null,null,null,null,{"$error":"#N/A"},{"$error":"#N/A"},null,null,null,251,"","",null,null,null,null,{"$error":"#N/A"},{"$error":"#N/A"}]
[null,null,null,null,null,252,"","",null,null,null,null,{"$error":"#N/A"},{"$error":"#N/A"},null,null,null,252,"","",null,null,null,null,{"$error":"#N/A"},{"$error":"#N/A"}]
[null,null,null,null,null,253,"","",null,null,null,null,{"$error":"#N/A"},{"$error":"#N/A"},null,null,null,253,"","",null,null,null,null,{"$error":"#N/A"},{"$error":"#N/A"}]
[null,null,null,null,null,254,"","",null,null,null,null,{"$error":"#N/A"},{"$error":"#N/A"},null,null,null,254,"","",null,null,null,null,{"$error":"#N/A"},{"$error":"#N/A"}]
[null,null,null,null,null,255,"","",null,null,null,null,{"$error":"#N/A"},{"$error":"#N/A"},null,null,null,255,"","",null,null,null,null,{"$error":"#N/A"},{"$error":"#N/A"}]
[null,null,null,null,null,256,"","",null,null,null,null,{"$error":"#N/A"},{"$error":"#N/A"},null,null,null,256,"","",null,null,null,null,{"$error":"#N/A"},{"$error":"#N/A"}]
[null,null,null,null,null,257,"","",null,null,null,null,{"$error":"#N/A"},{"$error":"#N/A"},null,null,null,257,"","",null,null,null,null,{"$error":"#N/A"},{"$error":"#N/A"}]
[null,null,null,null,null,258,{"$f":"IF(INDEX($A$1:$A$500,MATCH(\"Spe*\",$A$1:$A$500,0)+F258)=0,\"\",INDEX($A$1:$A$500,MATCH(\"Spe*\",$A$1:$A$500,0)+F258))","v":""},{"$f":"IF(INDEX($A$1:$A$500,MATCH(\"Spe*\",$A$1:$A$500,0)+F258)=0,\"\",INDEX($B$1:$B$500,MATCH(\"Spe*\",$A$1:$A$500,0)+F258))","v":""},null,null,null,null,{"$f":"IF(G258=\"\",NA(),ROUND(G258,0))","v":{"$error":"#N/A"}},{"$f":"IF(H258=\"\",NA(),H258)","v":{"$error":"#N/A"}},null,null,null,258,{"$f":"IF(INDEX($C$1:$C$500,MATCH(\"Spe*\",$C$1:$C$500,0)+R258)=0,\"\",INDEX($C$1:$C$500,MATCH(\"Spe*\",$C$1:$C$500,0)+R258))","v":""},{"$f":"IF(INDEX($C$1:$C$500,MATCH(\"Spe*\",$C$1:$C$500,0)+R258)=0,\"\",INDEX($D$1:$D$500,MATCH(\"Spe*\",$C$1:$C$500,0)+R258))","v":""},null,null,null,null,{"$error":"#N/A"},{"$error":"#N/A"}]

{"sheet":"Version 1.7","index":6,"n_rows":0,"n_cols":0,"rows_kept":0,"cut":false,"hidden":false,"merged":[]}